program: Orca
programVersion: 5.0.4
elementType: C N C N C C O H H H H H H H H H H
charge: 0
multiplicity: 1
keywords: Opt RIJCOSX PBEh-3c
formula: C4H10N2O
InChI: InChI=1/C4H10N2O/c1-5-4(7)6(2)3/h5H,1-3H3
17 atoms
C  2.662494 -0.033538 -0.46167
N  1.267171 -0.381584 -0.346837
C  0.364097 0.59163 0.002823
N  -0.930388 0.160998 0.156226
C  -1.918157 1.06068 0.69711
C  -1.343632 -1.195902 -0.083818
O  0.695324 1.754369 0.130322
H  2.7875 0.805084 -1.142042
H  3.121327 0.238763 0.492287
H  3.199478 -0.886036 -0.873949
H  1.072648 -1.33321 -0.091801
H  -2.274554 0.724979 1.675672
H  -2.780504 1.134754 0.030334
H  -1.487785 2.050174 0.809517
H  -0.870957 -1.604744 -0.977427
H  -2.418329 -1.215812 -0.261563
H  -1.145634 -1.870605 0.758514
totalener: -342.47544130 hartree
nucrepener: 328.27037157 hartree
electener: -670.74581287 hartree
oneelecener: -1115.53918319 hartree
twoeener: 444.79337032 hartree
kineticenergy: 339.95098985 hartree
exchangeener: -25.571637229922 hartree
correlationener: -2.446110816148 hartree
xcener: -28.017748046070 hartree
dispersion: -0.007740414 hartree
dispersion: -0.007742785 hartree
dispersion: -0.007744242 hartree
dispersion: -0.007743704 hartree
dispersion: -0.007742804 hartree
dispersion: -0.007742485 hartree
dispersion: -0.007742859 hartree
dispersion: -0.007743699 hartree
dispersion: -0.007744540 hartree
dispersion: -0.007744800 hartree
dispersion: -0.007744247 hartree
energy: -528.8122 -398.7928 -398.5634 -287.1703 -285.0553 -284.5656 -284.5347 -31.1879 -28.1484 -27.3149 -22.0733 -21.6935 -20.0528 -17.4168 -16.4654 -14.8403 -14.7400 -13.7225 -13.2362 -13.0236 -12.5495 -12.4080 -11.8905 -11.6322 -11.5376 -8.4844 -7.9413 -7.4957 2.8198 3.2944 4.5012 4.7625 4.9721 5.1178 5.3675 5.7664 6.1312 6.4321 6.6207 6.6758 6.9607 7.3491 9.8090 10.8464 12.2041 12.5263 13.5222 14.1213 14.6337 14.7764 15.9364 16.1277 17.1547 17.8180 18.4132 18.8449 19.2878 21.0678 23.1003 24.8635 25.2790 26.0199 26.1513 26.8951 27.0437 27.6603 27.9120 28.1812 28.4533 28.8110 29.0643 29.3279 29.7878 30.4113 32.0919 33.4412 34.6032 36.6872 37.8449 38.0217 38.6724 39.2561 41.0219 43.2873 45.0904 46.2693 49.6718 50.3998 50.8691 52.1704 53.5374 54.2048 55.1938 56.0385 56.7267 56.7551 57.7385 58.1569 59.0371 59.8929 60.7494 62.1422 62.7713 64.1965 65.1405 66.2546 67.0138 67.8161 68.7028 69.7780 72.3813 73.2349 74.5195 76.1908 76.8009 81.6721 89.1477 89.9782 372.6347 374.6831 376.3342 380.5404 524.6004 528.2431 701.9484 electronvolt
chargesum: -0.0000000
charge: -0.482743 -0.666091 0.726078 -0.482537 -0.503015 -0.525237 -0.469782 0.248951 0.218229 0.206655 0.355435 0.206605 0.209448 0.276155 0.233563 0.238908 0.209376
charge: -0.252880 -0.279994 0.126268 -0.168706 -0.250119 -0.259131 -0.301323 0.140170 0.116967 0.119530 0.249008 0.113034 0.116317 0.156135 0.129460 0.134608 0.110655
qa: -0.4827 -0.6661 0.7261 -0.4825 -0.5030 -0.5252 -0.4698 0.2490 0.2182 0.2067 0.3554 0.2066 0.2094 0.2762 0.2336 0.2389 0.2094
va: 3.7385 2.9513 4.0255 3.0687 3.6865 3.7110 2.1580 0.9051 0.9054 0.9159 0.8421 0.9078 0.9107 0.9133 0.9098 0.9096 0.9034
dispersion: -0.007743721 hartree
energy: -342.449017563568 hartree
dipole: -1.86038 1.45365 -0.40673 -4.39781 2.88139 -1.51642 0.23854 -0.17830 0.06023
magnitude: 1.57117 au
magnitude: 3.99360 debye
