program: Orca
programVersion: 5.0.4
elementType: C N C N C C O H H H H H H H H H H
charge: 0
multiplicity: 1
keywords: SP DSD-BLYP D3BJ def2-QZVPP def2-QZVPP/C def2/J TightSCF
formula: C4H10N2O
InChI: InChI=1/C4H10N2O/c1-5-4(7)6(2)3/h5H,1-3H3
17 atoms
C  2.542907 -0.308527 -0.478247
N  1.147585 -0.656572 -0.363414
C  0.244511 0.316642 -0.013754
N  -1.049974 -0.11399 0.139649
C  -2.037744 0.785691 0.680533
C  -1.463219 -1.470891 -0.100395
O  0.575737 1.479381 0.113744
H  2.667914 0.530096 -1.158619
H  3.00174 -0.036226 0.475709
H  3.079892 -1.161024 -0.890526
H  0.953062 -1.608198 -0.108378
H  -2.39414 0.449991 1.659094
H  -2.900091 0.859765 0.013757
H  -1.607371 1.775185 0.79294
H  -0.990544 -1.879732 -0.994004
H  -2.537916 -1.490801 -0.27814
H  -1.26522 -2.145593 0.741937
totalener: -342.25399851 hartree
nucrepener: 328.31459084 hartree
electener: -670.56858935 hartree
oneelecener: -1115.46403926 hartree
twoeener: 444.89544990 hartree
kineticenergy: 341.36781927 hartree
exchangeener: -14.250466714128 hartree
correlationener: -1.019070558309 hartree
xcener: -15.269537272437 hartree
chargesum: 0.0000000
charge: 0.011374 -0.397510 0.454166 -0.317937 -0.037872 -0.041653 -0.509831 0.101063 0.064367 0.048725 0.172913 0.056500 0.052313 0.131110 0.081431 0.078628 0.052212
charge: 0.141738 0.519099 -0.801289 0.362798 0.146495 0.131593 0.253637 -0.056793 -0.066982 -0.069631 -0.188884 -0.066497 -0.065724 -0.055366 -0.061426 -0.054630 -0.068138
qa: 0.0114 -0.3975 0.4542 -0.3179 -0.0379 -0.0417 -0.5098 0.1011 0.0644 0.0487 0.1729 0.0565 0.0523 0.1311 0.0814 0.0786 0.0522
va: 3.8507 3.0201 4.2336 2.9193 3.8260 3.8490 1.9819 0.9960 0.9878 0.9863 1.0201 0.9844 0.9861 0.9979 0.9915 0.9886 0.9901
total: -342.953556738 hartree
dispersion: -0.007760449 hartree
energy: -342.961317186971 hartree
dipole: -1.86038 1.42766 -0.43272 -4.39781 2.83688 -1.56092 0.23854 -0.19540 0.04313
magnitude: 1.62036 au
magnitude: 4.11864 debye
