program: Gaussian 09
title: 000076611
version: EM64L-G09RevD.01
frameworkgroup: C1[X(C11H15Cl2O2PS3)]
method: RPBEPBE
basis: SDD
operation: Freq
keyword: #p
keyword: freq=noraman
keyword: PBEPBE/SDD
title: #p freq=noraman PBEPBE/SDD
converged: NO YES NO NO
title: Mulliken charges:
elementType: Cl Cl S S S P O O C C C C C C C C C C C H H H H H H H H H H H H H H H
charge: -0.006245 0.004189 0.059946 0.257788 -0.231706 0.603488 -0.459180 -0.476520 -0.218892 -0.226610 -0.836029 -0.209122 -0.650293 -0.648488 -0.209617 -0.203926 -0.041337 -0.194079 -0.100446 0.221271 0.236862 0.238696 0.232791 0.346831 0.313929 0.212131 0.238396 0.229538 0.215384 0.235998 0.235918 0.285980 0.274962 0.268392
chargesum: 0.00000
title: Mulliken charges with hydrogens summed into heavy atoms:
elementType: Cl Cl S S S P O O C C C C C C C C C C C
charge: -0.006245 0.004189 0.059946 0.257788 -0.231706 0.603488 -0.459180 -0.476520 0.239241 0.244877 -0.175268 -0.209122 0.029772 0.038811 0.076363 0.071036 -0.041337 0.074313 -0.100446
polarizability: 2.73958025e+02 -1.49528124e+01 2.24897057e+02 1.43365703e+01 1.59211914e+01 1.94076544e+02
1716.lowfreq: -7.4745 -1.8931 -0.0030 -0.0029 -0.0023 4.3615 11.8586 19.9691 23.6268
frequency: 9.5187 19.8972 23.5783 36.2841 51.0170 54.8382 63.4413 67.3980 73.3682 87.8713 96.3192 125.0819 137.2043 153.1419 174.2757 182.8105 186.0731 202.0648 234.4625 238.6979 242.7873 260.1090 283.0914 291.9683 303.6245 324.2106 341.5242 375.7360 405.7651 427.6668 433.0408 440.1129 526.1267 541.0257 559.4315 611.8686 637.4106 656.9250 666.3625 691.0216 706.7362 764.2122 812.0341 814.2180 821.2394 840.5123 862.6659 887.3415 894.2151 959.0195 995.1856 1012.9746 1024.9024 1080.4373 1101.0811 1106.3746 1117.0888 1134.0149 1136.4327 1143.1619 1151.7155 1231.2092 1241.6900 1256.7846 1258.8459 1345.9351 1354.5597 1358.5003 1364.0062 1394.6883 1397.4906 1399.8964 1436.3180 1456.3775 1457.2906 1475.7924 1477.3250 1488.1211 1489.0494 1558.6085 1566.1276 2982.3014 2991.8494 2997.5301 2998.3781 3047.9029 3052.3020 3057.5267 3093.7670 3093.9470 3111.4450 3113.8020 3150.3566 3165.1118 3172.2887 3185.7299
redmass: 5.9010 11.8731 9.3762 4.3766 7.8484 4.3397 5.1523 2.0577 1.8028 3.6345 8.1370 6.4297 5.0788 6.6638 6.9681 12.2917 5.7977 6.9035 1.9664 1.9839 1.7672 2.3285 6.8953 5.1306 14.0705 5.1257 6.4002 7.9823 8.8309 7.4598 5.7552 3.1886 9.2880 12.2991 5.2386 8.0354 8.2010 7.4680 6.2671 3.9463 7.9935 8.5781 1.0960 1.0903 1.3271 1.4696 4.5409 3.5066 1.4265 1.3438 7.2535 2.3740 2.8517 2.2427 2.2530 2.2130 3.4524 1.4256 1.4277 1.3771 1.0370 1.1025 1.3033 1.1384 1.1311 3.5640 1.2560 1.2565 6.5080 1.2260 1.2283 1.0879 2.3894 1.0403 1.0398 1.0520 1.0525 1.0778 1.0781 8.1385 7.2146 1.0560 1.0534 1.0370 1.0391 1.1076 1.0550 1.1084 1.0981 1.0977 1.1020 1.1022 1.1120 1.0893 1.0930 1.0974
irintensity: 0.2820 0.0155 0.6663 0.2722 0.9818 0.3412 1.9115 0.6084 2.9902 1.7812 0.2730 7.2586 0.2947 0.7635 2.0264 0.6362 1.1994 1.6513 0.1287 2.7415 0.4616 0.9765 12.4301 3.2089 1.0207 3.9089 1.6564 5.9051 66.0737 3.1083 1.2632 12.1432 13.2661 154.1032 8.8427 4.6063 35.0523 9.1182 64.2717 3.1291 85.4448 25.2483 3.1194 5.1351 45.8233 9.8824 270.5968 34.5599 18.1403 0.3749 48.1010 165.7028 32.4076 3.5011 11.1353 3.4156 41.1628 1.1677 9.0279 0.7913 3.9429 29.6722 2.1340 0.1951 1.1201 12.1797 12.8253 5.8775 9.7330 16.3778 35.2418 7.6126 92.1794 14.7482 15.8232 9.5345 4.2512 2.8893 21.9846 15.9110 2.8655 28.8459 17.9425 25.8748 12.5962 10.3106 8.0884 10.0172 26.7003 16.7037 26.4645 34.1872 1.7844 0.4747 0.5577 0.2451
temp: 298.150 k
press: 1.00000 atm
elementType: 17 17 16 16 16 15 8 8 6 6 6 6 6 6 6 6 6 6 6 1 1 1 1 1 1 1 1 1 1 1 1 1 1 1
symmnumber: 1
zpe: 632977.5 jmol-1
zpe.correction: 0.241088 hartree
zpe.thermalcorrener: 0.265282 hartree
zpe.thermalcorrenthalpy: 0.266226 hartree
zpe.thermalcorrgfe: 0.181852 hartree
zpe.sumelectzpe: -3032.677048 hartree
zpe.sumelectthermal: -3032.652854 hartree
zpe.sumelectthermalent: -3032.651910 hartree
zpe.sumelectthermalfe: -3032.736284 hartree
dipole: -1.1857 1.1536 0.9542
dipole: 1.9097
quadrupole: -154.0215 -159.8099 -157.9928
quadrupole: -8.2179 -10.2236 0.3489
quadrupole: 3.2532 -2.5352 -0.7181 -8.2179 -10.2236 0.3489
hfenergy: -3032.9181363 hartree
pointgroup: C01 [X(C11H15Cl2O2P1S3)]
dipole: 0.4304404 -0.4260299 0.4446757 debye
polarizability: 254.4767328|-34.4828686|226.5857021|-21.2167661|-14.0734878|211.8691912 unknown
InChI: InChI=1S/C7H5Cl2S2.C4H10O2PS/c8-6-2-1-5(11-4-10)3-7(6)9;1-3-5-7(8)6-4-2/h1-3H,4H2;3-4H2,1-2H3
charge 0 multiplicity 1
34 atoms
Cl -3.480616 1.959439 2.389061
Cl -4.248103 2.508149 -0.763438
S  1.372287 -1.987395 -1.044911
S  -0.927442 -2.780059 0.937141
S  3.215246 0.717046 -2.709151
P  2.585889 -0.024855 -0.889383
O  3.760615 -0.378102 0.338071
O  1.639315 0.978467 0.161412
C  4.979844 -1.135892 -0.07455
C  0.704598 1.973428 -0.451645
C  0.838238 -2.140633 0.773853
C  -1.858034 -1.263915 0.449948
C  5.84661 -1.240999 1.176381
C  0.278241 2.899109 0.683214
C  -2.26062 -0.349548 1.44933
C  -2.19463 -1.037916 -0.904847
C  -2.992088 0.800427 1.086237
C  -2.928387 0.115068 -1.260895
C  -3.322461 1.035493 -0.266461
H  4.677557 -2.132696 -0.451737
H  5.488236 -0.580919 -0.885684
H  1.238217 2.517122 -1.25399
H  -0.154761 1.430059 -0.887306
H  0.932267 -1.152513 1.247836
H  1.473937 -2.884817 1.273361
H  6.775886 -1.791206 0.939155
H  6.117766 -0.23849 1.547294
H  5.316116 -1.780337 1.97923
H  -0.440249 3.646851 0.299279
H  -0.214791 2.333758 1.49149
H  1.149286 3.429148 1.102994
H  -2.012005 -0.527473 2.499144
H  -1.883341 -1.751254 -1.672014
H  -3.195523 0.304158 -2.304417
