program: Orca
programVersion: 5.0.4
elementType: N C C C C C F N C C C C C C C C H H H H H H H H H H H H H H H H H H H H H H H H H H H H
charge: 1
multiplicity: 1
keywords: SP DSD-BLYP D3BJ def2-QZVPP def2-QZVPP/C def2/J TightSCF
formula: C13H28FN2
InChI: InChI=1/C13H28FN2/c1-11(2,3)15-10(14)16(12(4,5)6)13(7,8)9/h15H,1-9H3
44 atoms
N  1.362193 0.201014 0.395959
C  2.816049 0.069705 0.054524
C  3.31517 -1.312154 0.466571
C  3.046975 0.340179 -1.429011
C  3.509176 1.145595 0.88693
C  0.327041 -0.345429 -0.169845
F  0.606085 -1.338432 -0.98127
N  -0.937224 -0.015585 -0.003675
C  -1.931665 -1.16451 0.198963
C  -2.659561 -1.507006 -1.097481
C  -2.91053 -0.80535 1.320663
C  -1.202309 -2.421151 0.709358
C  -1.30101 1.464413 0.002201
C  -2.609102 1.677469 -0.766883
C  -0.260466 2.280834 -0.783938
C  -1.399638 2.024389 1.420609
H  1.149819 0.830762 1.156477
H  4.39233 -1.366115 0.310949
H  3.126004 -1.504034 1.5228
H  2.865493 -2.113079 -0.117043
H  2.646471 1.309812 -1.725295
H  4.119684 0.359719 -1.617381
H  2.62779 -0.426284 -2.077658
H  4.583231 1.104515 0.716947
H  3.350345 1.000072 1.957582
H  3.175545 2.14858 0.613805
H  -1.95967 -1.743627 -1.897798
H  -3.315441 -0.713623 -1.442691
H  -3.281217 -2.387883 -0.93618
H  -3.589646 -1.647344 1.452164
H  -3.536155 0.060732 1.131342
H  -2.394452 -0.660082 2.269487
H  -1.954967 -3.10723 1.093773
H  -0.660833 -2.971232 -0.055043
H  -0.530575 -2.206092 1.543784
H  -2.506115 1.380742 -1.809842
H  -3.472756 1.174531 -0.348511
H  -2.83708 2.742564 -0.752794
H  0.670155 2.473887 -0.254356
H  -0.029734 1.833416 -1.752043
H  -0.691536 3.259658 -0.986628
H  -2.221144 1.605581 1.994026
H  -1.556901 3.101718 1.371636
H  -0.485375 1.868917 1.999149
totalener: -719.28283781 hartree
nucrepener: 1340.49572870 hartree
electener: -2059.77856650 hartree
oneelecener: -3621.61370303 hartree
twoeener: 1561.83513652 hartree
kineticenergy: 717.39064882 hartree
exchangeener: -31.217241788360 hartree
correlationener: -2.295649617366 hartree
xcener: -33.512891405726 hartree
chargesum: 1.0000000
charge: -0.334275 0.177303 -0.153235 -0.154842 -0.162181 0.593554 -0.221179 -0.224661 0.160217 -0.172822 -0.174377 -0.208784 0.178925 -0.184142 -0.193885 -0.142118 0.235106 0.078830 0.068037 0.070980 0.070315 0.089420 0.069640 0.087549 0.060057 0.068419 0.069861 0.069754 0.080026 0.092069 0.057266 0.070286 0.088486 0.083879 0.068127 0.079233 0.061139 0.088098 0.039328 0.078663 0.100851 0.081105 0.088690 0.021286
charge: 0.633621 -0.309296 0.264329 0.263499 0.259882 -0.662495 0.496084 0.450295 -0.275828 0.263565 0.260983 0.255674 -0.281118 0.266544 0.253924 0.261117 -0.124575 -0.037495 -0.048249 -0.053132 -0.050154 -0.035652 -0.052935 -0.034541 -0.047931 -0.049586 -0.049707 -0.057188 -0.037934 -0.035946 -0.064531 -0.046223 -0.035147 -0.057550 -0.050137 -0.042714 -0.064125 -0.036848 -0.061808 -0.044623 -0.034191 -0.053274 -0.036321 -0.058265
qa: -0.3343 0.1773 -0.1532 -0.1548 -0.1622 0.5936 -0.2212 -0.2247 0.1602 -0.1728 -0.1744 -0.2088 0.1789 -0.1841 -0.1939 -0.1421 0.2351 0.0788 0.0680 0.0710 0.0703 0.0894 0.0696 0.0875 0.0601 0.0684 0.0699 0.0698 0.0800 0.0921 0.0573 0.0703 0.0885 0.0839 0.0681 0.0792 0.0611 0.0881 0.0393 0.0787 0.1009 0.0811 0.0887 0.0213
va: 3.1818 3.7576 3.8705 3.8681 3.8701 3.8658 1.0962 2.7486 3.7770 3.9036 3.8726 3.8896 3.7555 3.8621 3.8702 3.9028 0.9820 1.0023 1.0018 1.0013 0.9995 1.0026 0.9983 1.0030 0.9975 0.9979 1.0057 1.0004 1.0024 0.9991 1.0049 1.0021 0.9973 0.9974 1.0014 1.0003 1.0055 0.9965 1.0105 1.0005 0.9941 1.0035 1.0020 1.0112
total: -720.823265168 hartree
dispersion: -0.029653670 hartree
energy: -720.852918837243 hartree
dipole: -2.73265 3.04862 0.31597 6.31518 -5.78175 0.53342 4.06413 -3.59864 0.46549
magnitude: 0.77528 au
magnitude: 1.97061 debye
