program: Orca
programVersion: 5.0.4
elementType: N C C C C C N C C C C C C C C H H H H H H H H H H H H H H H H H H H H H H H H H H H H
charge: 2
multiplicity: 1
keywords: Freq RIJCOSX PBEh-3c
frequency: 0.00 0.00 0.00 0.00 0.00 0.00 35.48 41.04 72.56 88.14 110.45 157.64 181.44 200.64 219.58 231.48 247.58 260.65 281.31 292.42 295.93 301.28 313.39 317.71 329.73 348.82 351.65 363.43 367.95 381.47 389.23 403.46 420.81 422.78 426.15 467.88 482.41 483.11 503.77 536.33 597.96 722.40 735.48 787.06 811.46 817.88 818.03 951.97 952.77 955.40 956.92 958.63 964.37 1006.04 1008.67 1010.51 1074.74 1076.51 1078.37 1079.60 1080.43 1081.33 1159.65 1161.86 1189.50 1273.74 1311.12 1311.78 1314.35 1317.90 1324.61 1347.61 1447.15 1458.26 1460.48 1463.16 1464.47 1467.03 1471.35 1487.87 1494.30 1498.63 1510.03 1511.18 1513.74 1516.46 1517.69 1518.10 1521.65 1522.64 1528.03 1543.47 1547.04 1548.28 1551.12 1554.56 1557.17 1558.21 1565.41 1567.56 2260.64 3119.31 3120.21 3122.24 3125.15 3128.69 3135.72 3136.76 3138.36 3140.68 3206.83 3207.25 3208.80 3212.31 3212.85 3213.51 3213.65 3213.75 3216.17 3217.93 3218.50 3219.90 3222.19 3225.74 3251.82 3259.48 3268.68 3271.19 3501.23
frequency: 35.48 41.04 72.56 88.14 110.45 157.64 181.44 200.64 219.58 231.48 247.58 260.65 281.31 292.42 295.93 301.28 313.39 317.71 329.73 348.82 351.65 363.43 367.95 381.47 389.23 403.46 420.81 422.78 426.15 467.88 482.41 483.11 503.77 536.33 597.96 722.40 735.48 787.06 811.46 817.88 818.03 951.97 952.77 955.40 956.92 958.63 964.37 1006.04 1008.67 1010.51 1074.74 1076.51 1078.37 1079.60 1080.43 1081.33 1159.65 1161.86 1189.50 1273.74 1311.12 1311.78 1314.35 1317.90 1324.61 1347.61 1447.15 1458.26 1460.48 1463.16 1464.47 1467.03 1471.35 1487.87 1494.30 1498.63 1510.03 1511.18 1513.74 1516.46 1517.69 1518.10 1521.65 1522.64 1528.03 1543.47 1547.04 1548.28 1551.12 1554.56 1557.17 1558.21 1565.41 1567.56 2260.64 3119.31 3120.21 3122.24 3125.15 3128.69 3135.72 3136.76 3138.36 3140.68 3206.83 3207.25 3208.80 3212.31 3212.85 3213.51 3213.65 3213.75 3216.17 3217.93 3218.50 3219.90 3222.19 3225.74 3251.82 3259.48 3268.68 3271.19 3501.23
formula: C13H28N2
InChI: InChI=1/C13H28N2/c1-11(2,3)14-10-15(12(4,5)6)13(7,8)9/h14H,1-9H3
43 atoms
N  1.599564 0.352822 -0.748676
C  2.750325 0.377759 0.327435
C  3.772078 -0.624268 -0.180297
C  3.267559 1.805031 0.315742
C  2.151031 -0.025407 1.656258
C  0.397457 0.139219 -0.547061
N  -0.782532 -0.072204 -0.335041
C  -1.246896 -1.648258 -0.356267
C  -2.521846 -1.743812 -1.162493
C  -1.407102 -2.052041 1.095049
C  -0.124142 -2.420528 -1.025953
C  -1.716788 1.260143 -0.089402
C  -2.632719 0.966114 1.075383
C  -0.770106 2.399277 0.242515
C  -2.436935 1.505606 -1.399872
H  1.894864 0.53209 -1.712757
H  4.182692 -0.35165 -1.153316
H  4.607757 -0.637154 0.520279
H  3.376959 -1.638689 -0.230023
H  3.658891 2.101828 -0.657837
H  2.514558 2.525368 0.63326
H  4.097595 1.868751 1.020221
H  1.391775 0.671443 2.014605
H  2.94706 -0.018181 2.400347
H  1.749189 -1.040022 1.645086
H  -2.400424 -1.409823 -2.191558
H  -2.782824 -2.802887 -1.20363
H  -3.367615 -1.238447 -0.70564
H  -0.503739 -1.890662 1.682215
H  -1.602278 -3.125991 1.106047
H  -2.246584 -1.577281 1.592188
H  0.064793 -2.101083 -2.051963
H  -0.438919 -3.462605 -1.086078
H  0.804192 -2.427474 -0.452291
H  -3.19926 1.879795 1.264465
H  -2.091127 0.735094 1.991021
H  -3.365866 0.189876 0.874689
H  -0.114616 2.681102 -0.582861
H  -1.381214 3.279172 0.445139
H  -0.186856 2.218235 1.146408
H  -3.161428 0.73821 -1.650505
H  -2.993113 2.438165 -1.287706
H  -1.753313 1.64367 -2.237028
totalener: -619.77452661 hartree
nucrepener: 1156.73786366 hartree
electener: -1776.51239026 hartree
oneelecener: -3097.62261851 hartree
twoeener: 1321.11022825 hartree
kineticenergy: 614.69186541 hartree
exchangeener: -50.115576154405 hartree
correlationener: -5.055958101108 hartree
xcener: -55.171534255513 hartree
energy: -410.2293 -410.1608 -297.8233 -294.5216 -294.5174 -294.3149 -291.6060 -291.5889 -291.4947 -291.2506 -291.2305 -291.2114 -291.2100 -291.1531 -291.1463 -40.1638 -38.4746 -33.0942 -33.0180 -32.6199 -29.4157 -29.0831 -28.9537 -28.8085 -28.6326 -28.5985 -27.9723 -26.6300 -26.4700 -26.1854 -23.5348 -23.5015 -23.3224 -22.2702 -21.9447 -21.5736 -21.3393 -21.2661 -21.1817 -20.8950 -20.6426 -20.4013 -19.6877 -19.5767 -19.4825 -19.4233 -19.2861 -19.2760 -19.1712 -19.0313 -19.0059 -18.9535 -18.8238 -18.6684 -18.4747 -18.4686 -18.3901 -18.3282 -17.9695 -9.6150 -9.4340 -6.1855 -5.6377 -4.5241 -3.7840 -3.7475 -3.3521 -3.2589 -3.0315 -2.6485 -2.5149 -2.4228 -2.1831 -2.1017 -1.8310 -1.7853 -1.6966 -1.5994 -1.4522 -1.2879 -1.2713 -1.1899 -0.9731 -0.8106 -0.7340 -0.7241 -0.6540 -0.5420 -0.3721 -0.2597 -0.1581 -0.0449 0.1332 0.2610 0.4683 0.5238 0.6071 0.6641 0.9052 1.1280 1.8224 2.1785 3.6521 4.7445 5.3485 5.5599 5.9241 6.1928 6.3099 6.5811 7.1686 7.2880 7.5890 7.6656 7.8876 7.9573 8.0796 8.2548 8.6024 8.9001 9.2578 9.6475 10.0514 10.2365 10.3595 10.9215 11.2434 11.3709 11.4962 12.0578 12.1655 12.6554 13.0325 13.0493 14.0174 14.7213 14.9092 15.1281 15.4228 15.5519 16.0460 16.6248 17.3608 17.7158 18.1797 19.1030 19.3803 19.6092 19.8909 20.1077 20.2737 20.3913 20.5435 20.6394 20.8280 20.9538 21.1012 21.1875 21.2090 21.4033 21.6135 21.8189 21.8613 22.1591 22.2344 22.5162 22.7946 23.0059 23.3262 23.4251 23.7360 24.0546 24.3278 25.0563 25.4782 25.6246 25.9636 26.5993 26.9575 27.4614 28.9774 29.5414 30.6951 30.8879 31.4703 32.2171 32.4759 32.6602 33.0411 33.5755 33.8649 34.9155 35.5782 35.8762 36.4693 36.9706 37.3165 38.2344 38.9932 39.6114 40.0335 40.7309 40.8176 41.0860 41.2996 41.9350 42.4084 43.3986 43.7085 44.6768 44.8294 45.4863 45.5421 45.8134 46.1879 48.3653 48.5577 48.7979 48.9584 49.2654 49.3248 49.8623 50.2343 50.5513 51.0059 51.2996 51.5793 51.7869 51.9519 53.3780 53.6619 53.8969 54.7085 55.1121 55.5240 55.6650 55.7615 55.8739 55.9462 55.9832 56.1556 56.3202 56.5619 56.8203 57.3412 57.4107 60.3888 62.2460 62.6197 63.3006 63.3690 64.2457 64.4796 64.8808 65.5154 66.2897 66.6797 66.8124 66.8698 67.0544 67.1769 67.5971 72.2713 75.4954 76.0708 82.0722 361.2575 362.4567 362.6301 369.8729 370.1436 370.4761 370.6435 371.0992 371.4785 374.4450 376.5176 376.6410 376.8255 520.7437 522.6831 electronvolt
chargesum: 2.0000000
charge: -0.513227 -0.042391 -0.624308 -0.616682 -0.684730 0.766289 -0.350312 -0.019582 -0.649998 -0.628789 -0.695822 -0.020775 -0.649179 -0.698389 -0.622795 0.465824 0.267114 0.309047 0.261320 0.266367 0.258167 0.307999 0.250919 0.332200 0.250254 0.272214 0.313845 0.267114 0.249909 0.308671 0.283955 0.266290 0.332229 0.247232 0.313956 0.267450 0.268468 0.252420 0.333332 0.261175 0.283491 0.308482 0.251246
charge: -0.045162 0.015774 -0.345460 -0.344396 -0.355747 0.289913 0.048108 0.046499 -0.344741 -0.342520 -0.357431 0.047005 -0.344854 -0.357775 -0.342296 0.337777 0.155814 0.183842 0.151161 0.155885 0.150317 0.183341 0.144154 0.191539 0.143731 0.157701 0.184950 0.150695 0.145332 0.183008 0.159257 0.153397 0.191098 0.141963 0.184826 0.155674 0.151206 0.146533 0.191182 0.146972 0.159035 0.183498 0.149194
qa: -0.5132 -0.0424 -0.6243 -0.6167 -0.6847 0.7663 -0.3503 -0.0196 -0.6500 -0.6288 -0.6958 -0.0208 -0.6492 -0.6984 -0.6228 0.4658 0.2671 0.3090 0.2613 0.2664 0.2582 0.3080 0.2509 0.3322 0.2503 0.2722 0.3138 0.2671 0.2499 0.3087 0.2840 0.2663 0.3322 0.2472 0.3140 0.2674 0.2685 0.2524 0.3333 0.2612 0.2835 0.3085 0.2512
va: 3.2128 3.6501 3.5867 3.5875 3.5934 3.6308 3.2144 3.6236 3.5917 3.5775 3.5954 3.6238 3.5920 3.5919 3.5809 0.7657 0.8983 0.8809 0.8995 0.8985 0.9010 0.8811 0.9045 0.8719 0.9046 0.8937 0.8762 0.9010 0.9067 0.8778 0.8909 0.8956 0.8725 0.9050 0.8762 0.8956 0.9007 0.9019 0.8714 0.8998 0.8907 0.8783 0.9051
dispersion: -0.029404945 hartree
energy: -619.744093342885 hartree
dipole: -0.88470 1.47271 0.58801 -0.57218 0.74877 0.17658 2.86658 -3.43767 -0.57109
magnitude: 0.83850 au
magnitude: 2.13130 debye
temp: 298.15 k
press: 1.00 atm
zeropoint: 0.40533360 hartree
thermalvibcorrection: 0.01650291 hartree
thermalrotcorrection: 0.00141627 hartree
thermaltrasncorrection: 0.00141627 hartree
thermaltotal: -619.31942430 hartree
thermalcorr: 0.01933545 hartree
nonthermalcorr: 0.40533360 hartree
totalcorr: 0.42466905 hartree
thermalcorrenthalpy: 0.00094421 hartree
totalenthalpy: -619.31848009 hartree
vibrat: 0.02791713 hartree
rotat: 0.01534827 hartree
transl: 0.01993799 hartree
total: 0.06320339 hartree
totalentropycorr: -0.06320339 hartree
gibbsenthalpy: -619.38168348 hartree
gibbsminuselec: 0.36240986 hartree
