program: Orca
programVersion: 5.0.4
elementType: N C F N C C H H H H H H H H
charge: 1
multiplicity: 1
keywords: Freq RIJCOSX PBEh-3c
frequency: 0.00 0.00 0.00 0.00 0.00 0.00 83.61 124.97 212.49 311.35 395.38 504.26 527.81 533.71 598.37 665.73 766.80 812.73 919.10 1021.41 1092.92 1138.10 1185.64 1209.38 1355.11 1426.19 1452.06 1479.49 1538.24 1543.42 1556.73 1642.06 1745.62 1842.74 3133.42 3144.86 3209.30 3225.30 3234.52 3642.06 3653.52 3758.57
frequency: 83.61 124.97 212.49 311.35 395.38 504.26 527.81 533.71 598.37 665.73 766.80 812.73 919.10 1021.41 1092.92 1138.10 1185.64 1209.38 1355.11 1426.19 1452.06 1479.49 1538.24 1543.42 1556.73 1642.06 1745.62 1842.74 3133.42 3144.86 3209.30 3225.30 3234.52 3642.06 3653.52 3758.57
formula: C3H8FN2
InChI: InChI=1/C3H8FN2/c1-2-6-3(4)5/h6H,2,5H2,1H3
14 atoms
N  1.920595 -0.059911 0.395419
C  1.321994 0.516882 -0.613766
F  2.090087 0.878503 -1.5933
N  0.054726 0.771538 -0.729519
C  -0.966639 0.458693 0.281184
C  -1.436741 -0.983616 0.232835
H  2.924287 -0.174765 0.388418
H  1.418258 -0.411134 1.195704
H  -0.24219 1.190959 -1.601717
H  -1.792245 1.141025 0.092089
H  -0.574362 0.733044 1.262428
H  -2.202905 -1.13416 0.991671
H  -1.876788 -1.22824 -0.732272
H  -0.638176 -1.698817 0.430826
totalener: -327.58503403 hartree
nucrepener: 257.19844008 hartree
electener: -584.78347411 hartree
oneelecener: -945.89645560 hartree
twoeener: 361.11298149 hartree
kineticenergy: 325.30876177 hartree
exchangeener: -23.153304159562 hartree
correlationener: -2.121966644870 hartree
xcener: -25.275270804432 hartree
energy: -690.0760 -405.5576 -405.4432 -295.5235 -290.4372 -288.3318 -44.1856 -35.9030 -33.9032 -28.6030 -26.0654 -24.7011 -24.4779 -22.9876 -21.9649 -21.5763 -20.4893 -19.5616 -18.6633 -18.3264 -16.9262 -16.3615 -15.8018 -14.6492 -4.4503 -2.3142 -1.8557 -0.7564 -0.2377 0.4548 1.0812 1.2114 1.4879 1.6459 2.4701 2.8003 3.7886 6.7471 7.6638 8.4255 8.6896 9.5507 9.7817 10.2550 10.9638 11.5600 13.0063 14.0448 16.1113 17.1474 19.3396 20.0365 20.9167 21.2366 21.7278 22.1935 22.9098 23.2393 24.3217 24.3831 24.9914 25.2800 26.4561 26.7723 27.9311 28.6493 29.2198 29.3406 32.4445 33.1567 35.4651 35.7603 37.6925 39.4450 39.8694 40.1596 43.0828 43.9520 46.6965 47.1976 49.0659 49.4496 50.0868 51.5838 54.4148 55.5503 57.0618 57.8125 59.7807 60.0262 60.6471 62.0837 63.6864 65.7657 67.0576 67.3587 69.1839 74.4961 78.0868 80.4448 366.4682 374.3060 375.4999 516.6895 519.9743 887.0728 electronvolt
chargesum: 1.0000000
charge: -0.774178 0.900596 -0.211772 -0.586926 -0.358825 -0.646278 0.450422 0.442283 0.438584 0.309647 0.263068 0.283329 0.265241 0.224810
charge: -0.274473 0.301486 -0.046694 -0.147139 -0.150756 -0.369078 0.312600 0.300764 0.309679 0.166864 0.143513 0.165849 0.153890 0.133496
qa: -0.7742 0.9006 -0.2118 -0.5869 -0.3588 -0.6463 0.4504 0.4423 0.4386 0.3096 0.2631 0.2833 0.2652 0.2248
va: 3.0170 3.8607 1.2244 3.1337 3.6013 3.6609 0.7869 0.7923 0.7907 0.8723 0.8900 0.8884 0.8962 0.9125
dispersion: -0.005778754 hartree
energy: -327.563752291684 hartree
dipole: -8.44154 8.49534 0.05380 -4.10012 3.99597 -0.10415 5.84296 -5.14536 0.69760
magnitude: 0.70738 au
magnitude: 1.79801 debye
temp: 298.15 k
press: 1.00 atm
zeropoint: 0.12458606 hartree
thermalvibcorrection: 0.00400302 hartree
thermalrotcorrection: 0.00141627 hartree
thermaltrasncorrection: 0.00141627 hartree
thermaltotal: -327.43233067 hartree
thermalcorr: 0.00683557 hartree
nonthermalcorr: 0.12458606 hartree
totalcorr: 0.13142163 hartree
thermalcorrenthalpy: 0.00094421 hartree
totalenthalpy: -327.43138646 hartree
vibrat: 0.00672032 hartree
rotat: 0.01273488 hartree
transl: 0.01873937 hartree
total: 0.03819457 hartree
totalentropycorr: -0.03819457 hartree
gibbsenthalpy: -327.46958103 hartree
gibbsminuselec: 0.09417127 hartree
