program: Orca
programVersion: 5.0.4
elementType: N C F N C C H H H H H H H H
charge: 1
multiplicity: 1
keywords: Opt RIJCOSX PBEh-3c
formula: C3H8FN2
InChI: InChI=1/C3H8FN2/c1-2-6-3(4)5/h6H,2,5H2,1H3
14 atoms
N  1.920595 -0.059911 0.395419
C  1.321994 0.516882 -0.613766
F  2.090087 0.878503 -1.5933
N  0.054726 0.771538 -0.729519
C  -0.966639 0.458693 0.281184
C  -1.436741 -0.983616 0.232835
H  2.924287 -0.174765 0.388418
H  1.418258 -0.411134 1.195704
H  -0.24219 1.190959 -1.601717
H  -1.792244 1.141025 0.092089
H  -0.574362 0.733044 1.262428
H  -2.202905 -1.13416 0.991671
H  -1.876788 -1.22824 -0.732272
H  -0.638176 -1.698817 0.430826
totalener: -327.58502771 hartree
nucrepener: 257.21589108 hartree
electener: -584.80091879 hartree
oneelecener: -945.93201167 hartree
twoeener: 361.13109288 hartree
kineticenergy: 325.30699938 hartree
exchangeener: -23.153110709837 hartree
correlationener: -2.121963921195 hartree
xcener: -25.275074631033 hartree
dispersion: -0.005780765 hartree
dispersion: -0.005779717 hartree
energy: -690.0770 -405.5569 -405.4444 -295.5233 -290.4370 -288.3319 -44.1859 -35.9030 -33.9033 -28.6029 -26.0656 -24.7012 -24.4780 -22.9877 -21.9651 -21.5765 -20.4893 -19.5618 -18.6633 -18.3263 -16.9263 -16.3614 -15.8017 -14.6491 -4.4502 -2.3143 -1.8558 -0.7563 -0.2378 0.4548 1.0813 1.2113 1.4879 1.6459 2.4701 2.8003 3.7886 6.7471 7.6638 8.4255 8.6896 9.5507 9.7818 10.2550 10.9639 11.5601 13.0064 14.0447 16.1110 17.1474 19.3397 20.0367 20.9167 21.2364 21.7277 22.1935 22.9098 23.2393 24.3217 24.3830 24.9914 25.2800 26.4561 26.7722 27.9309 28.6493 29.2197 29.3404 32.4445 33.1567 35.4652 35.7604 37.6924 39.4449 39.8690 40.1596 43.0830 43.9521 46.6965 47.1975 49.0660 49.4497 50.0868 51.5838 54.4148 55.5504 57.0618 57.8124 59.7807 60.0262 60.6471 62.0837 63.6865 65.7656 67.0576 67.3588 69.1840 74.4959 78.0868 80.4449 366.4683 374.3061 375.5000 516.6888 519.9747 887.0720 electronvolt
chargesum: 1.0000000
charge: -0.774135 0.900576 -0.211765 -0.586956 -0.358837 -0.646281 0.450419 0.442278 0.438591 0.309649 0.263071 0.283328 0.265246 0.224817
charge: -0.274437 0.301465 -0.046688 -0.147163 -0.150760 -0.369078 0.312598 0.300760 0.309684 0.166864 0.143514 0.165849 0.153892 0.133499
qa: -0.7741 0.9006 -0.2118 -0.5870 -0.3588 -0.6463 0.4504 0.4423 0.4386 0.3096 0.2631 0.2833 0.2652 0.2248
va: 3.0170 3.8608 1.2244 3.1337 3.6013 3.6609 0.7869 0.7923 0.7907 0.8723 0.8900 0.8884 0.8962 0.9125
dispersion: -0.005778754 hartree
energy: -327.563752279681 hartree
dipole: -8.44154 8.49542 0.05388 -4.10012 3.99588 -0.10424 5.84296 -5.14534 0.69762
magnitude: 0.70742 au
magnitude: 1.79811 debye
