program: Orca
programVersion: 5.0.4
elementType: N C F N C C H H H H H H H H
charge: 1
multiplicity: 1
keywords: SP DSD-BLYP D3BJ def2-QZVPP def2-QZVPP/C def2/J TightSCF
formula: C3H8FN2
InChI: InChI=1/C3H8FN2/c1-2-6-3(4)5/h6H,2,5H2,1H3
14 atoms
N  1.356646 -0.333944 0.769753
C  0.758044 0.242848 -0.239432
F  1.526137 0.60447 -1.218966
N  -0.509224 0.497505 -0.355186
C  -1.530589 0.18466 0.655518
C  -2.000691 -1.257649 0.607169
H  2.360337 -0.448798 0.762752
H  0.854308 -0.685167 1.570038
H  -0.80614 0.916926 -1.227383
H  -2.356194 0.866991 0.466423
H  -1.138312 0.459011 1.636762
H  -2.766855 -1.408193 1.366005
H  -2.440738 -1.502273 -0.357938
H  -1.202126 -1.97285 0.80516
totalener: -327.45325551 hartree
nucrepener: 257.19843982 hartree
electener: -584.65169533 hartree
oneelecener: -946.07781390 hartree
twoeener: 361.42611858 hartree
kineticenergy: 326.61765679 hartree
exchangeener: -12.904606523210 hartree
correlationener: -0.889247911773 hartree
xcener: -13.793854434983 hartree
chargesum: 1.0000000
charge: -0.287139 0.541209 -0.147456 -0.233754 0.080696 -0.119482 0.271557 0.253324 0.256636 0.105000 0.067224 0.097377 0.080910 0.033898
charge: 0.761950 -0.642632 0.513656 0.610896 0.058074 0.257650 -0.108093 -0.120698 -0.107164 -0.031053 -0.042041 -0.040185 -0.048989 -0.061368
qa: -0.2871 0.5412 -0.1475 -0.2338 0.0807 -0.1195 0.2716 0.2533 0.2566 0.1050 0.0672 0.0974 0.0809 0.0339
va: 3.3409 4.1491 1.1761 3.2905 3.8077 3.8771 0.9618 0.9849 0.9736 0.9844 0.9889 1.0017 1.0048 1.0067
total: -328.058406739 hartree
dispersion: -0.005702677 hartree
energy: -328.064109416232 hartree
dipole: -8.44154 8.43531 -0.00623 -4.10012 3.97099 -0.12913 5.84296 -5.10433 0.73863
magnitude: 0.74986 au
magnitude: 1.90599 debye
