program: Orca
programVersion: 5.0.4
elementType: N C N C C O H H H H H H H H
charge: 0
multiplicity: 1
keywords: SP DSD-BLYP D3BJ def2-QZVPP def2-QZVPP/C def2/J TightSCF
formula: C3H8N2O
InChI: InChI=1/C3H8N2O/c1-2-5-3(4)6/h5H,2,4H2,1H3
14 atoms
N  2.105632 0.070602 0.417954
C  0.873156 -0.100701 -0.178944
N  -0.120082 -0.442047 0.701573
C  -1.498794 -0.48826 0.266003
C  -2.162727 0.876111 0.152047
O  0.693167 0.046175 -1.367918
H  2.867353 0.142059 -0.234602
H  2.320225 -0.476088 1.234498
H  0.030071 -0.212661 1.670096
H  -1.529494 -0.998597 -0.695325
H  -2.044803 -1.11776 0.971266
H  -3.204241 0.770908 -0.15424
H  -1.655471 1.491163 -0.589659
H  -2.15206 1.408057 1.104867
totalener: -303.09254474 hartree
nucrepener: 248.48862534 hartree
electener: -551.58117008 hartree
oneelecener: -904.28042694 hartree
twoeener: 352.69925686 hartree
kineticenergy: 302.30459005 hartree
exchangeener: -12.417259029894 hartree
correlationener: -0.878394216988 hartree
xcener: -13.295653246882 hartree
chargesum: -0.0000000
charge: -0.425833 0.488707 -0.386136 0.116958 -0.179599 -0.493100 0.219443 0.184570 0.168846 0.077720 0.048301 0.050312 0.094881 0.034929
charge: 0.641316 -0.817489 0.525292 -0.006271 0.231398 0.256202 -0.172381 -0.185203 -0.177001 -0.045371 -0.058621 -0.063537 -0.058427 -0.069907
qa: -0.4258 0.4887 -0.3861 0.1170 -0.1796 -0.4931 0.2194 0.1846 0.1688 0.0777 0.0483 0.0503 0.0949 0.0349
va: 3.0558 4.2554 3.0202 3.8258 3.8437 1.9856 1.0043 1.0100 1.0233 1.0035 0.9868 1.0062 1.0004 1.0007
total: -303.700100626 hartree
dispersion: -0.005845814 hartree
energy: -303.705946439646 hartree
dipole: -5.01527 5.14788 0.13261 0.94345 -1.25641 -0.31296 3.08829 -1.63545 1.45284
magnitude: 1.49207 au
magnitude: 3.79253 debye
