program: Orca
programVersion: 5.0.4
elementType: C F H H
charge: 1
multiplicity: 1
keywords: Freq RIJCOSX PBEh-3c
frequency: 0.00 0.00 0.00 0.00 0.00 0.00 1263.91 1316.53 1467.98 1671.62 3163.37 3333.28
frequency: 1263.91 1316.53 1467.98 1671.62 3163.37 3333.28
formula: CH2F
InChI: InChI=1/CH2F/c1-2/h1H2
4 atoms
C  -0.058069 0.006407 0.380127
F  1.166035 -0.131154 0.426808
H  -0.443546 0.867645 -0.166775
H  -0.66442 -0.742898 0.89024
totalener: -138.46063758 hartree
nucrepener: 34.07563766 hartree
electener: -172.53627524 hartree
oneelecener: -252.30902186 hartree
twoeener: 79.77274662 hartree
kineticenergy: 137.67973114 hartree
exchangeener: -8.722508331159 hartree
correlationener: -0.710040532022 hartree
xcener: -9.432548863181 hartree
energy: -694.5188 -298.3698 -48.6055 -30.7062 -26.6723 -26.2819 -25.1583 -21.3314 -11.0204 -3.4312 -2.7565 -0.9624 5.0599 6.3334 7.0684 9.0053 17.2625 18.0561 22.6528 23.5206 24.2547 25.0125 25.4975 27.3624 35.5634 38.1860 39.0166 48.2668 52.7181 53.4665 57.5149 70.6373 362.3704 879.1793 electronvolt
chargesum: 1.0000000
charge: 0.317034 -0.015122 0.349075 0.349013
charge: 0.448982 0.126478 0.212288 0.212253
qa: 0.3170 -0.0151 0.3491 0.3490
va: 3.1159 1.4831 0.8473 0.8474
dispersion: -0.000523193 hartree
energy: -138.453228589643 hartree
dipole: -2.70477 1.26110 -1.44367 0.30438 -0.14202 0.16237 -0.10221 0.04727 -0.05494
magnitude: 1.45381 au
magnitude: 3.69530 debye
temp: 298.15 k
press: 1.00 atm
zeropoint: 0.02783165 hartree
thermalvibcorrection: 0.00003143 hartree
thermalrotcorrection: 0.00141627 hartree
thermaltrasncorrection: 0.00141627 hartree
thermaltotal: -138.42253297 hartree
thermalcorr: 0.00286398 hartree
nonthermalcorr: 0.02783165 hartree
totalcorr: 0.03069562 hartree
thermalcorrenthalpy: 0.00094421 hartree
totalenthalpy: -138.42158876 hartree
vibrat: 0.00003630 hartree
rotat: 0.00837375 hartree
transl: 0.01730215 hartree
total: 0.02571219 hartree
totalentropycorr: -0.02571219 hartree
gibbsenthalpy: -138.44730095 hartree
gibbsminuselec: 0.00592764 hartree
