program: Orca
programVersion: 5.0.4
elementType: C F H H
charge: 1
multiplicity: 1
keywords: SP DSD-BLYP D3BJ def2-QZVPP def2-QZVPP/C def2/J TightSCF
formula: CH2F
InChI: InChI=1/CH2F/c1-2/h1H2
4 atoms
C  -0.673923 0.075719 -0.025732
F  0.55018 -0.061842 0.020949
H  -1.0594 0.936956 -0.572634
H  -1.280275 -0.673586 0.484382
totalener: -138.48018076 hartree
nucrepener: 34.07563766 hartree
electener: -172.55581842 hartree
oneelecener: -252.54862834 hartree
twoeener: 79.99280992 hartree
kineticenergy: 138.17723200 hartree
exchangeener: -4.866188645936 hartree
correlationener: -0.301916987923 hartree
xcener: -5.168105633859 hartree
energy: -709.9421 -308.9699 -51.6241 -32.6861 -28.4277 -27.7781 -26.5578 -22.8164 -9.0322 -3.7694 -2.9763 -2.2873 -0.9857 -0.1595 0.1299 3.1423 4.0303 4.6242 4.7038 5.0410 5.7425 9.0648 10.5427 10.7495 11.0183 14.3616 14.6318 14.7832 15.0617 15.3784 15.4469 17.3078 17.6048 21.7185 25.8566 25.9348 26.0766 28.6818 36.6133 37.6941 37.9971 39.0746 39.3980 41.4940 41.5334 41.9917 43.6631 44.9434 45.5991 45.7906 47.9580 48.5095 49.5531 50.5750 54.1254 55.3000 57.6870 58.7769 60.8394 60.8842 62.2583 63.1675 65.7261 66.7683 67.4960 68.1736 72.4204 73.4085 79.9926 80.3408 85.3708 86.2656 86.7904 87.8428 91.7737 94.4195 97.6547 103.1107 112.5376 112.8838 114.8158 115.5991 119.7275 126.1707 127.0917 129.9230 135.4968 135.7484 137.3337 137.7962 140.6146 141.1485 143.9860 144.5330 148.3025 149.3435 150.0213 151.7109 151.8231 154.3930 155.0385 158.1930 160.4877 160.5093 161.9463 163.3083 164.0417 164.4335 165.6887 167.6238 169.7752 173.3482 175.3686 175.6293 177.5401 181.3218 187.1287 191.5447 191.5762 198.3563 198.7303 199.7124 199.7292 201.7490 204.0948 205.4084 205.7760 207.7700 210.6350 217.2990 218.6345 219.2982 221.0679 221.9413 227.3669 230.3442 230.4991 238.7740 239.6332 256.7053 259.2934 261.9936 263.4848 272.9220 277.7986 279.7009 308.2272 309.1765 309.2940 313.3366 314.3918 319.1557 325.9992 334.6481 339.6140 342.5476 357.7200 398.4064 399.0377 407.7094 408.0936 411.4989 427.2079 432.4218 433.1011 435.2169 442.8436 450.8132 453.4355 468.5379 779.5581 1500.1446 4039.9286 7818.6764 electronvolt
chargesum: 1.0000000
charge: 0.468686 0.020805 0.254702 0.255807
charge: 0.352804 0.683376 -0.018080 -0.018100
qa: 0.4687 0.0208 0.2547 0.2558
va: 3.2727 1.4578 0.9267 0.9259
total: -138.684036855 hartree
dispersion: -0.000513533 hartree
energy: -138.684550388396 hartree
dipole: -2.70477 1.18794 -1.51683 0.30438 -0.13377 0.17062 -0.10221 0.04455 -0.05765
magnitude: 1.52748 au
magnitude: 3.88256 debye
