program: Orca
programVersion: 5.0.4
elementType: C O H H
charge: 0
multiplicity: 1
keywords: Freq RIJCOSX PBEh-3c
frequency: 0.00 0.00 0.00 0.00 0.00 0.00 1257.59 1306.29 1593.40 1930.54 2992.87 3056.92
frequency: 1257.59 1306.29 1593.40 1930.54 2992.87 3056.92
formula: CH2O
InChI: InChI=1/CH2O/c1-2/h1H2
4 atoms
C  -0.001387 0.000042 0.000253
O  1.176766 -0.036008 -0.198035
H  -0.629277 -0.908274 0.020254
H  -0.546103 0.94434 0.177528
totalener: -114.25814227 hartree
nucrepener: 31.48161084 hartree
electener: -145.73975311 hartree
oneelecener: -217.79833006 hartree
twoeener: 72.05857695 hartree
kineticenergy: 113.52660843 hartree
exchangeener: -7.871799700787 hartree
correlationener: -0.693814919293 hartree
xcener: -8.565614620081 hartree
energy: -531.0440 -286.8640 -32.0444 -19.4222 -15.3693 -14.1657 -12.4465 -8.8805 -0.1327 4.2533 6.8434 7.0598 13.6762 14.7675 17.8800 20.7410 25.6300 25.9987 27.0204 29.0683 32.1168 42.3090 42.8213 46.9655 51.4456 51.9135 54.4213 60.0630 65.1322 71.3093 75.3981 80.1794 371.2745 693.1271 electronvolt
chargesum: -0.0000000
charge: -0.031563 -0.280929 0.156274 0.156219
charge: -0.004176 -0.158978 0.081582 0.081571
qa: -0.0316 -0.2809 0.1563 0.1562
va: 3.8606 2.2040 0.9084 0.9084
dispersion: -0.000601227 hartree
energy: -114.251047110505 hartree
dipole: -2.19543 1.29594 -0.89949 0.06727 -0.03976 0.02750 0.36943 -0.21803 0.15140
magnitude: 0.91256 au
magnitude: 2.31954 debye
temp: 298.15 k
press: 1.00 atm
zeropoint: 0.02765148 hartree
thermalvibcorrection: 0.00002833 hartree
thermalrotcorrection: 0.00141627 hartree
thermaltrasncorrection: 0.00141627 hartree
thermaltotal: -114.22053475 hartree
thermalcorr: 0.00286088 hartree
nonthermalcorr: 0.02765148 hartree
totalcorr: 0.03051236 hartree
thermalcorrenthalpy: 0.00094421 hartree
totalenthalpy: -114.21959054 hartree
vibrat: 0.00003278 hartree
rotat: 0.00759110 hartree
transl: 0.01716732 hartree
total: 0.02479120 hartree
totalentropycorr: -0.02479120 hartree
gibbsenthalpy: -114.24438174 hartree
gibbsminuselec: 0.00666537 hartree
