program: Orca
programVersion: 5.0.4
elementType: N C C C F N C C H H H H H H H H H H H H
charge: 1
multiplicity: 1
keywords: Freq RIJCOSX PBEh-3c
frequency: 0.00 0.00 0.00 0.00 0.00 0.00 37.59 46.26 104.30 148.31 186.17 236.51 292.37 316.29 349.48 443.05 522.97 529.37 652.33 671.12 759.50 807.26 854.28 892.12 960.85 1023.27 1094.21 1140.22 1175.98 1195.97 1202.15 1211.53 1350.52 1360.41 1392.14 1422.03 1464.13 1477.92 1480.94 1514.20 1539.65 1544.29 1546.71 1547.15 1556.31 1565.78 1704.48 1833.71 3113.60 3133.64 3135.50 3166.09 3173.05 3216.30 3224.60 3228.17 3236.67 3237.59 3652.02 3671.67
frequency: 37.59 46.26 104.30 148.31 186.17 236.51 292.37 316.29 349.48 443.05 522.97 529.37 652.33 671.12 759.50 807.26 854.28 892.12 960.85 1023.27 1094.21 1140.22 1175.98 1195.97 1202.15 1211.53 1350.52 1360.41 1392.14 1422.03 1464.13 1477.92 1480.94 1514.20 1539.65 1544.29 1546.71 1547.15 1556.31 1565.78 1704.48 1833.71 3113.60 3133.64 3135.50 3166.09 3173.05 3216.30 3224.60 3228.17 3236.67 3237.59 3652.02 3671.67
formula: C5H12FN2
InChI: InChI=1/C5H12FN2/c1-3-7-5(6)8-4-2/h7-8H,3-4H2,1-2H3
20 atoms
N  -1.205104 0.710004 -0.125407
C  -1.926633 -0.550926 0.075292
C  -3.378349 -0.396427 -0.329966
C  0.06665 0.882904 0.112407
F  0.536942 2.072696 -0.115642
N  0.900625 -0.01242 0.558638
C  2.350088 0.183618 0.751647
C  3.148893 -0.167246 -0.488695
H  -1.721644 1.513618 -0.458579
H  -1.8570 -0.834295 1.128217
H  -1.451877 -1.32932 -0.527117
H  -3.883896 0.363753 0.264851
H  -3.899274 -1.336848 -0.164882
H  -3.477937 -0.148334 -1.386068
H  0.543128 -0.94544 0.707587
H  2.52536 1.20978 1.066881
H  2.624713 -0.451168 1.59196
H  2.993831 -1.20202 -0.791832
H  4.210158 -0.04332 -0.278857
H  2.901124 0.481194 -1.327935
totalener: -406.05345383 hartree
nucrepener: 403.39649176 hartree
electener: -809.44994558 hartree
oneelecener: -1339.92343203 hartree
twoeener: 530.47348645 hartree
kineticenergy: 403.11233680 hartree
exchangeener: -29.720810071486 hartree
correlationener: -2.801254382976 hartree
xcener: -32.522064454462 hartree
energy: -689.6596 -405.1033 -405.0228 -294.8945 -290.1258 -289.8211 -288.0701 -287.7615 -43.7145 -35.5086 -33.6198 -28.4898 -27.7142 -25.3752 -24.5113 -23.9155 -23.1250 -22.4958 -21.5872 -19.8882 -19.4905 -19.3140 -19.1248 -18.0045 -17.7344 -16.5600 -16.4328 -16.0746 -15.8045 -15.3520 -15.2439 -13.7398 -4.0122 -1.7490 -1.4701 -0.2565 -0.1181 0.4847 0.9184 1.2974 1.3913 1.4741 1.7641 1.8907 2.1338 2.2146 2.3719 2.9328 3.1391 3.4778 4.8717 7.2283 7.8392 8.2753 8.5191 9.5573 9.9605 10.2158 10.5183 10.6364 11.3135 11.6536 11.9183 13.0289 13.8180 13.9828 15.7962 16.6395 18.9462 19.4455 20.9316 21.4673 21.4827 22.0654 22.4729 22.8743 23.0370 23.4148 24.1007 24.2190 24.3242 24.4635 24.8541 25.2413 25.4396 25.7394 26.9243 27.2879 27.6703 29.4943 29.5696 29.9756 30.7997 33.4828 33.6775 34.8473 35.1506 36.1828 37.0105 39.5899 40.1479 41.2153 41.6391 44.0038 44.6674 46.8248 47.6661 47.8595 48.6911 49.9128 50.4001 50.6460 51.4858 52.6549 52.9498 53.1446 55.6794 56.6988 57.8491 58.5200 59.6661 59.9722 60.7979 61.3631 61.5975 62.9657 64.6783 66.3907 67.1710 67.7469 68.6990 69.2278 71.8134 75.8636 80.5964 82.2944 367.0023 367.4160 374.7378 375.5037 377.3249 519.0864 521.7412 888.0500 electronvolt
chargesum: 1.0000000
charge: -0.621427 -0.328541 -0.689476 0.940760 -0.224422 -0.626024 -0.332326 -0.645179 0.431367 0.271281 0.265937 0.257072 0.285748 0.258077 0.427665 0.285565 0.283203 0.241343 0.275875 0.243500
charge: -0.165635 -0.152382 -0.365446 0.297585 -0.054700 -0.157246 -0.142555 -0.367468 0.304423 0.144071 0.142224 0.148807 0.166724 0.149207 0.294466 0.156436 0.154566 0.142208 0.162054 0.142662
qa: -0.6214 -0.3285 -0.6895 0.9408 -0.2244 -0.6260 -0.3323 -0.6452 0.4314 0.2713 0.2659 0.2571 0.2857 0.2581 0.4277 0.2856 0.2832 0.2413 0.2759 0.2435
va: 3.0991 3.6229 3.6863 3.7885 1.2102 3.1130 3.6125 3.6736 0.7983 0.8783 0.8813 0.8967 0.8907 0.8962 0.7964 0.8843 0.8812 0.9044 0.8929 0.9052
dispersion: -0.008946333 hartree
energy: -406.023802871397 hartree
dipole: -1.70576 1.24758 -0.45817 -8.44813 7.80601 -0.64211 -0.50181 0.74738 0.24556
magnitude: 0.82615 au
magnitude: 2.09991 debye
temp: 298.15 k
press: 1.00 atm
zeropoint: 0.18303419 hartree
thermalvibcorrection: 0.00685502 hartree
thermalrotcorrection: 0.00141627 hartree
thermaltrasncorrection: 0.00141627 hartree
thermaltotal: -405.83108112 hartree
thermalcorr: 0.00968756 hartree
nonthermalcorr: 0.18303419 hartree
totalcorr: 0.19272176 hartree
thermalcorrenthalpy: 0.00094421 hartree
totalenthalpy: -405.83013691 hartree
vibrat: 0.01212945 hartree
rotat: 0.01375396 hartree
transl: 0.01911955 hartree
total: 0.04500295 hartree
totalentropycorr: -0.04500295 hartree
gibbsenthalpy: -405.87513986 hartree
gibbsminuselec: 0.14866301 hartree
