program: Orca
programVersion: 5.0.4
elementType: N C C C F N C C H H H H H H H H H H H H
charge: 1
multiplicity: 1
keywords: Opt RIJCOSX PBEh-3c
formula: C5H12FN2
InChI: InChI=1/C5H12FN2/c1-3-7-5(6)8-4-2/h7-8H,3-4H2,1-2H3
20 atoms
N  -1.205104 0.710004 -0.125407
C  -1.926633 -0.550926 0.075292
C  -3.378349 -0.396427 -0.329966
C  0.06665 0.882904 0.112407
F  0.536942 2.072696 -0.115642
N  0.900625 -0.01242 0.558638
C  2.350088 0.183618 0.751647
C  3.148893 -0.167246 -0.488695
H  -1.721644 1.513618 -0.458579
H  -1.8570 -0.834295 1.128217
H  -1.451877 -1.32932 -0.527117
H  -3.883896 0.363753 0.264851
H  -3.899274 -1.336848 -0.164882
H  -3.477937 -0.148334 -1.386068
H  0.543128 -0.94544 0.707587
H  2.52536 1.20978 1.066881
H  2.624713 -0.451168 1.59196
H  2.993831 -1.20202 -0.791832
H  4.210158 -0.04332 -0.278857
H  2.901124 0.481194 -1.327935
totalener: -406.05339369 hartree
nucrepener: 403.06395350 hartree
electener: -809.11734719 hartree
oneelecener: -1339.25505377 hartree
twoeener: 530.13770658 hartree
kineticenergy: 403.11351549 hartree
exchangeener: -29.720938617630 hartree
correlationener: -2.801245980979 hartree
xcener: -32.522184598609 hartree
dispersion: -0.008937107 hartree
dispersion: -0.008937970 hartree
dispersion: -0.008940383 hartree
dispersion: -0.008941757 hartree
dispersion: -0.008944223 hartree
dispersion: -0.008945477 hartree
energy: -689.6608 -405.1034 -405.0227 -294.8949 -290.1258 -289.8213 -288.0703 -287.7617 -43.7150 -35.5087 -33.6199 -28.4898 -27.7142 -25.3754 -24.5114 -23.9156 -23.1251 -22.4960 -21.5875 -19.8884 -19.4906 -19.3140 -19.1250 -18.0046 -17.7345 -16.5600 -16.4328 -16.0746 -15.8046 -15.3520 -15.2439 -13.7398 -4.0123 -1.7491 -1.4702 -0.2565 -0.1182 0.4847 0.9183 1.2974 1.3913 1.4741 1.7641 1.8906 2.1338 2.2145 2.3719 2.9327 3.1391 3.4777 4.8716 7.2282 7.8391 8.2752 8.5191 9.5572 9.9604 10.2158 10.5182 10.6363 11.3134 11.6535 11.9183 13.0288 13.8179 13.9827 15.7962 16.6395 18.9462 19.4455 20.9315 21.4673 21.4827 22.0653 22.4729 22.8743 23.0369 23.4147 24.1007 24.2190 24.3242 24.4634 24.8541 25.2413 25.4395 25.7393 26.9241 27.2877 27.6701 29.4941 29.5694 29.9753 30.7995 33.4827 33.6774 34.8473 35.1506 36.1827 37.0103 39.5898 40.1478 41.2151 41.6391 44.0038 44.6673 46.8247 47.6660 47.8594 48.6911 49.9127 50.4000 50.6459 51.4857 52.6548 52.9496 53.1446 55.6793 56.6987 57.8490 58.5199 59.6661 59.9722 60.7978 61.3630 61.5975 62.9656 64.6782 66.3906 67.1709 67.7468 68.6989 69.2277 71.8133 75.8632 80.5962 82.2943 367.0022 367.4159 374.7377 375.5035 377.3246 519.0863 521.7412 888.0489 electronvolt
chargesum: 1.0000000
charge: -0.621430 -0.328545 -0.689458 0.940771 -0.224406 -0.626030 -0.332312 -0.645169 0.431362 0.271278 0.265935 0.257066 0.285742 0.258073 0.427658 0.285558 0.283198 0.241342 0.275870 0.243496
charge: -0.165640 -0.152384 -0.365438 0.297594 -0.054686 -0.157250 -0.142548 -0.367462 0.304420 0.144069 0.142223 0.148804 0.166720 0.149205 0.294461 0.156431 0.154562 0.142207 0.162051 0.142660
qa: -0.6214 -0.3285 -0.6895 0.9408 -0.2244 -0.6260 -0.3323 -0.6452 0.4314 0.2713 0.2659 0.2571 0.2857 0.2581 0.4277 0.2856 0.2832 0.2413 0.2759 0.2435
va: 3.0991 3.6229 3.6863 3.7885 1.2102 3.1130 3.6125 3.6736 0.7983 0.8783 0.8813 0.8967 0.8907 0.8962 0.7964 0.8843 0.8812 0.9044 0.8929 0.9052
dispersion: -0.008946333 hartree
energy: -406.023802854721 hartree
dipole: -1.70576 1.24761 -0.45815 -8.44813 7.80606 -0.64207 -0.50181 0.74732 0.24551
magnitude: 0.82609 au
magnitude: 2.09975 debye
