program: Orca
programVersion: 5.0.4
elementType: N C C C F N C C H H H H H H H H H H H H
charge: 1
multiplicity: 1
keywords: SP DSD-BLYP D3BJ def2-QZVPP def2-QZVPP/C def2/J TightSCF
formula: C5H12FN2
InChI: InChI=1/C5H12FN2/c1-3-7-5(6)8-4-2/h7-8H,3-4H2,1-2H3
20 atoms
N  -1.277021 0.325419 -0.168572
C  -1.99855 -0.935511 0.032128
C  -3.450265 -0.781012 -0.37313
C  -0.005267 0.498319 0.069243
F  0.465025 1.688111 -0.158807
N  0.828708 -0.397004 0.515474
C  2.278171 -0.200966 0.708483
C  3.076976 -0.55183 -0.531859
H  -1.793561 1.129033 -0.501743
H  -1.928917 -1.21888 1.085053
H  -1.523794 -1.713905 -0.570281
H  -3.955813 -0.020831 0.221687
H  -3.971191 -1.721433 -0.208047
H  -3.549854 -0.532919 -1.429232
H  0.471211 -1.330024 0.664422
H  2.453443 0.825196 1.023717
H  2.552796 -0.835753 1.548796
H  2.921914 -1.586605 -0.834997
H  4.138242 -0.427905 -0.322022
H  2.829207 0.096609 -1.3711
totalener: -405.83054092 hartree
nucrepener: 403.39649158 hartree
electener: -809.22703250 hartree
oneelecener: -1340.11939822 hartree
twoeener: 530.89236572 hartree
kineticenergy: 404.77832301 hartree
exchangeener: -16.569172305691 hartree
correlationener: -1.168040801209 hartree
xcener: -17.737213106900 hartree
chargesum: 1.0000000
charge: -0.268950 0.074725 -0.174184 0.543635 -0.170018 -0.283459 0.111614 -0.133923 0.255995 0.092210 0.082778 0.077610 0.090060 0.081626 0.229425 0.089023 0.089903 0.057287 0.089963 0.064678
charge: 0.601115 0.039995 0.263855 -0.640042 0.507775 0.605665 0.063367 0.256628 -0.115970 -0.042888 -0.043566 -0.051215 -0.040367 -0.051133 -0.122704 -0.038679 -0.037950 -0.055466 -0.042495 -0.055923
qa: -0.2689 0.0747 -0.1742 0.5436 -0.1700 -0.2835 0.1116 -0.1339 0.2560 0.0922 0.0828 0.0776 0.0901 0.0816 0.2294 0.0890 0.0899 0.0573 0.0900 0.0647
va: 3.2162 3.7601 3.8986 4.0679 1.1586 3.3008 3.7733 3.8791 0.9789 0.9681 0.9685 0.9949 1.0046 0.9947 0.9980 0.9881 0.9807 1.0029 1.0043 1.0035
total: -406.617212711 hartree
dispersion: -0.008735208 hartree
energy: -406.625947918155 hartree
dipole: -1.70576 1.26814 -0.43762 -8.44813 7.76369 -0.68444 -0.50181 0.75468 0.25287
magnitude: 0.85083 au
magnitude: 2.16263 debye
