program: Orca
programVersion: 5.0.4
elementType: N C C C F F N C C H H H H H H H H H H H H
charge: 0
multiplicity: 1
keywords: Opt RIJCOSX PBEh-3c
formula: C5H12F2N2
InChI: InChI=1/C5H12F2N2/c1-3-8-5(6,7)9-4-2/h8-9H,3-4H2,1-2H3
21 atoms
N  -1.09807 -0.206286 0.647873
C  -1.585265 -0.622359 -0.654564
C  -2.838576 0.096567 -1.139191
C  -0.239851 0.892161 0.744801
F  -0.779631 2.080629 0.299375
F  -0.046685 1.117266 2.08815
N  0.949053 0.709296 0.026057
C  1.836304 -0.360502 0.451666
C  2.960667 -0.533613 -0.552389
H  -1.814547 -0.193581 1.359461
H  -0.773457 -0.49165 -1.369762
H  -1.781157 -1.696298 -0.606988
H  -2.667717 1.162644 -1.274934
H  -3.662309 -0.024281 -0.432946
H  -3.167929 -0.316609 -2.093305
H  1.439096 1.585565 -0.093332
H  2.255685 -0.182781 1.449311
H  1.253348 -1.278695 0.517537
H  3.572238 0.367517 -0.629315
H  3.620381 -1.347324 -0.252963
H  2.568621 -0.757564 -1.544041
totalener: -505.95805166 hartree
nucrepener: 522.97027599 hartree
electener: -1028.92832765 hartree
oneelecener: -1731.92367788 hartree
twoeener: 702.99535023 hartree
kineticenergy: 502.50249078 hartree
exchangeener: -35.527140298665 hartree
correlationener: -3.280022908853 hartree
xcener: -38.807163207518 hartree
dispersion: -0.009962957 hartree
energy: -682.5775 -682.5569 -398.2502 -398.2293 -289.6377 -284.7950 -284.7719 -283.8157 -283.6425 -37.1474 -35.2401 -28.5797 -27.1549 -23.1038 -22.6042 -19.9713 -19.1998 -18.4166 -17.3654 -16.5496 -16.1170 -14.6204 -14.3794 -13.7348 -13.4313 -13.1977 -13.0452 -12.7255 -12.2961 -12.1931 -11.5929 -11.5248 -11.2950 -11.0351 -10.7570 -8.4157 -8.0593 3.5320 4.0404 4.5960 4.8719 5.0652 5.2692 5.4751 5.6660 5.8022 5.9533 6.2436 6.3414 6.3709 6.5726 7.1867 7.3653 7.9482 8.5094 10.2233 10.6276 12.7986 13.4210 13.5534 14.1294 14.5056 14.7786 15.0294 15.4909 15.8780 16.3548 16.6753 17.1815 18.2200 19.7324 21.1071 21.9600 23.7682 24.4703 25.2244 25.8988 26.8831 26.9877 27.3268 27.7155 28.0075 28.1889 28.2668 28.5603 28.7760 28.8301 29.2070 29.4871 29.6624 29.8659 31.3936 32.2589 33.4209 33.7164 34.0796 34.3003 34.7615 35.2280 35.9602 36.5013 37.7272 38.1686 38.5048 38.9608 39.5218 41.5283 42.7037 44.1100 44.4252 45.5493 45.6222 48.0108 48.2738 49.2003 49.5255 51.1410 51.7792 52.7559 54.2879 54.9442 55.1726 56.2769 56.4960 57.0159 57.8243 58.6769 59.2801 60.2351 61.6438 62.7007 63.4536 64.2394 64.3941 65.0024 65.1978 66.5409 68.3597 68.8502 70.1935 70.9129 72.3837 73.1862 74.4480 76.9700 79.0418 80.8978 81.6320 84.6464 85.8823 371.7797 372.2462 379.5104 379.9984 384.2773 525.0562 526.3002 895.6810 899.8214 electronvolt
chargesum: 0.0000000
charge: -0.649504 -0.301601 -0.649038 0.967502 -0.347361 -0.346802 -0.649573 -0.281274 -0.658571 0.346399 0.243299 0.217549 0.238019 0.204111 0.213753 0.345164 0.212175 0.239060 0.207904 0.221918 0.226872
charge: -0.281425 -0.163399 -0.380939 0.271863 -0.199971 -0.196743 -0.288287 -0.157793 -0.368543 0.249075 0.136799 0.118301 0.135610 0.121418 0.128693 0.248681 0.108634 0.132376 0.122668 0.131452 0.131529
qa: -0.6495 -0.3016 -0.6490 0.9675 -0.3474 -0.3468 -0.6496 -0.2813 -0.6586 0.3464 0.2433 0.2175 0.2380 0.2041 0.2138 0.3452 0.2122 0.2391 0.2079 0.2219 0.2269
va: 2.9076 3.7558 3.7183 4.0527 1.0558 1.0555 2.8921 3.7398 3.7421 0.8533 0.9097 0.9041 0.9128 0.9165 0.9136 0.8537 0.9002 0.9026 0.9149 0.9126 0.9103
dispersion: -0.009962595 hartree
energy: -505.916513199300 hartree
dipole: 2.60015 -2.45165 0.14851 -9.90780 9.38844 -0.51936 -9.32436 8.98788 -0.33648
magnitude: 0.63640 au
magnitude: 1.61761 debye
