program: Orca
programVersion: 5.0.4
elementType: N C C C N C C O H H H H H H H H H H H H
charge: 0
multiplicity: 1
keywords: Freq RIJCOSX PBEh-3c
frequency: 0.00 0.00 0.00 0.00 0.00 0.00 62.27 71.03 108.37 125.11 200.16 244.15 300.66 352.12 357.14 441.74 479.42 509.24 548.24 712.26 792.61 809.63 851.88 923.48 953.90 1010.38 1109.03 1135.89 1160.62 1185.57 1213.77 1249.87 1303.93 1368.07 1375.24 1431.30 1437.29 1467.39 1468.44 1534.70 1536.30 1544.70 1547.16 1556.36 1556.47 1572.91 1633.13 1876.36 3117.24 3117.33 3132.19 3132.80 3189.26 3189.41 3204.47 3204.61 3221.52 3222.27 3687.13 3690.60
frequency: 62.27 71.03 108.37 125.11 200.16 244.15 300.66 352.12 357.14 441.74 479.42 509.24 548.24 712.26 792.61 809.63 851.88 923.48 953.90 1010.38 1109.03 1135.89 1160.62 1185.57 1213.77 1249.87 1303.93 1368.07 1375.24 1431.30 1437.29 1467.39 1468.44 1534.70 1536.30 1544.70 1547.16 1556.36 1556.47 1572.91 1633.13 1876.36 3117.24 3117.33 3132.19 3132.80 3189.26 3189.41 3204.47 3204.61 3221.52 3222.27 3687.13 3690.60
formula: C5H12N2O
InChI: InChI=1/C5H12N2O/c1-3-6-5(8)7-4-2/h6-7H,3-4H2,1-2H3
20 atoms
N  -1.125444 0.520408 -0.489777
C  -2.299847 0.767366 0.318409
C  -3.115632 -0.478917 0.631033
C  0.007049 -0.005912 0.08162
N  0.974862 -0.356229 -0.827761
C  2.28847 -0.756148 -0.37238
C  3.186482 0.401858 0.037814
O  0.140124 -0.149476 1.279564
H  -1.298769 0.289724 -1.454284
H  -2.914348 1.499018 -0.209991
H  -1.976298 1.242226 1.243179
H  -2.521517 -1.19623 1.194979
H  -3.467711 -0.965443 -0.280298
H  -3.992211 -0.224173 1.227971
H  0.942239 0.096581 -1.726305
H  2.753996 -1.329445 -1.176615
H  2.158728 -1.441544 0.463552
H  4.164345 0.036409 0.353695
H  3.34627 1.096996 -0.788256
H  2.749212 0.952831 0.869053
totalener: -381.72096325 hartree
nucrepener: 396.00868025 hartree
electener: -777.72964350 hartree
oneelecener: -1303.07889630 hartree
twoeener: 525.34925280 hartree
kineticenergy: 378.86461498 hartree
exchangeener: -28.856428444388 hartree
correlationener: -2.785746892797 hartree
xcener: -31.642175337185 hartree
energy: -529.0330 -398.5348 -398.5328 -287.2510 -284.7887 -284.7876 -283.5536 -283.5533 -31.2650 -27.9124 -27.2295 -23.0865 -22.2269 -19.7376 -18.6421 -17.5986 -17.1237 -14.9999 -14.0204 -13.6772 -13.4866 -13.0115 -12.7411 -12.5458 -11.5833 -11.5000 -11.2778 -10.7648 -10.6987 -8.6634 -8.0734 -7.8568 2.7614 3.1799 4.3991 4.5809 5.2343 5.3295 5.6188 5.6291 5.8827 6.0345 6.1228 6.1409 6.4065 6.5737 7.1550 7.4766 8.1285 9.4239 11.3333 12.6486 13.5594 13.6761 13.7889 14.2872 14.7225 14.7305 15.6889 15.9941 16.4875 17.0262 17.5900 18.0335 18.9738 19.7819 22.0169 22.4255 23.5164 24.2691 24.7270 26.3224 26.6403 27.1613 27.5080 27.8321 27.9135 27.9518 28.3761 28.4868 28.7828 29.2718 29.3017 29.6649 30.0954 30.1667 32.5785 32.9443 33.2332 35.0009 37.1032 38.1048 38.8983 39.5283 41.1490 42.0115 43.2900 44.8899 46.7892 47.9274 48.2240 50.2283 50.5725 50.7522 51.5699 52.8292 54.1670 54.5637 54.9451 55.7743 56.0623 56.6397 58.0453 58.3682 59.5802 61.4978 61.7551 63.4583 63.7255 64.9934 65.3246 66.2744 66.5102 67.1289 67.8529 70.9443 71.1589 71.9842 72.1500 73.5454 74.6338 74.8972 77.9049 81.4690 87.9309 89.0802 371.4819 372.4230 378.9718 380.5956 381.2799 524.0992 528.1330 702.0842 electronvolt
chargesum: 0.0000000
charge: -0.660522 -0.286815 -0.647809 0.727036 -0.660659 -0.286887 -0.647515 -0.461355 0.336170 0.213216 0.252524 0.247678 0.198702 0.214067 0.336189 0.213132 0.252681 0.214063 0.198658 0.247447
charge: -0.271918 -0.155909 -0.377801 0.121056 -0.271951 -0.155964 -0.377692 -0.296921 0.244361 0.117965 0.142180 0.141225 0.118925 0.128968 0.244356 0.117903 0.142225 0.128962 0.118909 0.141122
qa: -0.6605 -0.2868 -0.6478 0.7270 -0.6607 -0.2869 -0.6475 -0.4614 0.3362 0.2132 0.2525 0.2477 0.1987 0.2141 0.3362 0.2131 0.2527 0.2141 0.1987 0.2474
va: 2.9511 3.7585 3.7139 4.0270 2.9508 3.7584 3.7139 2.1565 0.8586 0.9073 0.9037 0.9075 0.9181 0.9148 0.8586 0.9073 0.9036 0.9148 0.9181 0.9076
dispersion: -0.009307702 hartree
energy: -381.692437330452 hartree
dipole: -0.13636 -0.01917 -0.15553 0.13918 0.02733 0.16652 -1.23494 -0.16488 -1.39982
magnitude: 1.41824 au
magnitude: 3.60489 debye
temp: 298.15 k
press: 1.00 atm
zeropoint: 0.18277082 hartree
thermalvibcorrection: 0.00676738 hartree
thermalrotcorrection: 0.00141627 hartree
thermaltrasncorrection: 0.00141627 hartree
thermaltotal: -381.50006658 hartree
thermalcorr: 0.00959993 hartree
nonthermalcorr: 0.18277082 hartree
totalcorr: 0.19237075 hartree
thermalcorrenthalpy: 0.00094421 hartree
totalenthalpy: -381.49912237 hartree
vibrat: 0.01181406 hartree
rotat: 0.01357901 hartree
transl: 0.01908345 hartree
total: 0.04447652 hartree
totalentropycorr: -0.04447652 hartree
gibbsenthalpy: -381.54359889 hartree
gibbsminuselec: 0.14883844 hartree
