program: Orca
programVersion: 5.0.4
elementType: N C C C N C C O H H H H H H H H H H H H
charge: 0
multiplicity: 1
keywords: SP DSD-BLYP D3BJ def2-QZVPP def2-QZVPP/C def2/J TightSCF
formula: C5H12N2O
InChI: InChI=1/C5H12N2O/c1-3-6-5(8)7-4-2/h6-7H,3-4H2,1-2H3
20 atoms
N  -1.132979 0.528124 -0.576705
C  -2.307381 0.775082 0.231481
C  -3.123167 -0.471201 0.544105
C  -0.000485 0.001805 -0.005308
N  0.967327 -0.348513 -0.914689
C  2.280936 -0.748432 -0.459309
C  3.178948 0.409574 -0.049115
O  0.132589 -0.14176 1.192636
H  -1.306303 0.297441 -1.541212
H  -2.921882 1.506734 -0.29692
H  -1.983832 1.249942 1.156251
H  -2.529051 -1.188514 1.108051
H  -3.475246 -0.957727 -0.367227
H  -3.999746 -0.216457 1.141042
H  0.934705 0.104297 -1.813233
H  2.746461 -1.321729 -1.263543
H  2.151193 -1.433828 0.376624
H  4.15681 0.044126 0.266767
H  3.338736 1.104713 -0.875184
H  2.741678 0.960548 0.782125
totalener: -381.45862022 hartree
nucrepener: 396.00868020 hartree
electener: -777.46730041 hartree
oneelecener: -1302.90534030 hartree
twoeener: 525.43803988 hartree
kineticenergy: 380.45873438 hartree
exchangeener: -16.082376562569 hartree
correlationener: -1.157885899617 hartree
xcener: -17.240262462186 hartree
chargesum: 0.0000000
charge: -0.404050 0.111898 -0.182443 0.515912 -0.400872 0.107158 -0.184365 -0.514862 0.166283 0.047780 0.079721 0.094054 0.037936 0.047892 0.164793 0.050618 0.081057 0.047310 0.038103 0.096078
charge: 0.527747 -0.007865 0.230695 -0.809051 0.527835 -0.008181 0.230523 0.262454 -0.179018 -0.059045 -0.045848 -0.058982 -0.070341 -0.063970 -0.179082 -0.058963 -0.045783 -0.063970 -0.070321 -0.058833
qa: -0.4040 0.1119 -0.1824 0.5159 -0.4009 0.1072 -0.1844 -0.5149 0.1663 0.0478 0.0797 0.0941 0.0379 0.0479 0.1648 0.0506 0.0811 0.0473 0.0381 0.0961
va: 3.0223 3.8302 3.8432 4.1728 3.0230 3.8291 3.8436 1.9782 1.0263 0.9873 1.0020 1.0017 1.0004 1.0070 1.0270 0.9867 1.0017 1.0071 1.0003 1.0005
total: -382.248147702 hartree
dispersion: -0.009205934 hartree
energy: -382.257353635393 hartree
dipole: -0.13636 -0.01974 -0.15610 0.13918 0.02780 0.16698 -1.23494 -0.16819 -1.40313
magnitude: 1.42162 au
magnitude: 3.61348 debye
