program: Orca
programVersion: 5.0.4
elementType: N C F N C C C C C C H H H H H H H H H H H H H H H H
charge: 1
multiplicity: 1
keywords: Freq RIJCOSX PBEh-3c
frequency: 0.00 0.00 0.00 0.00 0.00 0.00 42.84 67.35 75.35 89.41 108.69 160.35 197.10 224.02 238.59 285.98 331.47 343.63 394.64 457.89 479.50 578.76 592.28 603.14 759.23 772.17 814.42 819.58 851.35 912.54 980.44 1005.65 1057.55 1130.51 1135.70 1137.77 1151.26 1156.78 1200.66 1251.56 1262.57 1352.36 1362.59 1381.31 1417.88 1425.29 1438.09 1477.64 1478.63 1481.00 1517.19 1538.26 1539.55 1540.39 1544.78 1545.40 1549.67 1555.42 1557.80 1582.96 1642.78 1825.64 3130.11 3132.24 3133.40 3137.02 3160.94 3170.81 3195.12 3210.86 3214.13 3216.49 3225.59 3226.50 3228.16 3230.71 3234.19 3697.31
frequency: 42.84 67.35 75.35 89.41 108.69 160.35 197.10 224.02 238.59 285.98 331.47 343.63 394.64 457.89 479.50 578.76 592.28 603.14 759.23 772.17 814.42 819.58 851.35 912.54 980.44 1005.65 1057.55 1130.51 1135.70 1137.77 1151.26 1156.78 1200.66 1251.56 1262.57 1352.36 1362.59 1381.31 1417.88 1425.29 1438.09 1477.64 1478.63 1481.00 1517.19 1538.26 1539.55 1540.39 1544.78 1545.40 1549.67 1555.42 1557.80 1582.96 1642.78 1825.64 3130.11 3132.24 3133.40 3137.02 3160.94 3170.81 3195.12 3210.86 3214.13 3216.49 3225.59 3226.50 3228.16 3230.71 3234.19 3697.31
formula: C7H16FN2
InChI: InChI=1/C7H16FN2/c1-4-9-7(8)10(5-2)6-3/h9H,4-6H2,1-3H3
26 atoms
N  1.29852 -0.146888 0.702912
C  0.298459 -0.559923 -0.035936
F  0.535186 -1.617248 -0.759701
N  -0.89487 -0.042198 -0.112121
C  -1.927054 -0.583816 -1.019376
C  -2.820747 -1.599091 -0.334282
C  -1.267979 1.111608 0.716072
C  -0.870904 2.438555 0.093238
C  2.634807 -0.766814 0.743582
C  3.550668 -0.258827 -0.352917
H  1.181135 0.714307 1.213554
H  -2.502117 0.275876 -1.363191
H  -1.452606 -1.004963 -1.9027
H  -3.591163 -1.928288 -1.029956
H  -2.26479 -2.480129 -0.017174
H  -3.327231 -1.18098 0.535533
H  -2.348098 1.06081 0.844857
H  -0.855448 0.986973 1.719854
H  -1.207703 3.255598 0.729186
H  -1.33163 2.572988 -0.884645
H  0.207124 2.543648 -0.032159
H  2.522837 -1.848343 0.70525
H  3.036345 -0.533653 1.727935
H  3.182094 -0.517422 -1.344693
H  4.534015 -0.712932 -0.240497
H  3.68105 0.821551 -0.302824
totalener: -484.51800645 hartree
nucrepener: 596.83963721 hartree
electener: -1081.35764367 hartree
oneelecener: -1828.38829886 hartree
twoeener: 747.03065520 hartree
kineticenergy: 480.89591279 hartree
exchangeener: -36.286035463258 hartree
correlationener: -3.483951421053 hartree
xcener: -39.769986884311 hartree
energy: -689.3407 -404.8622 -404.6945 -294.4552 -289.8803 -289.5833 -289.5803 -288.0043 -287.6275 -287.5767 -43.3638 -35.2273 -33.4456 -28.2211 -28.0719 -27.0391 -25.1187 -24.2579 -24.0423 -23.5013 -22.3211 -21.2434 -20.9810 -19.7422 -19.1060 -19.0167 -18.3132 -18.0368 -17.7806 -17.5573 -17.2106 -16.4375 -16.0495 -15.6797 -15.5825 -15.4352 -15.1567 -15.0440 -15.0358 -13.0207 -3.7202 -1.7402 -0.8833 -0.1822 0.3802 0.5316 0.6994 0.7797 1.2372 1.4518 1.4868 1.6501 1.7356 1.9515 2.1590 2.2415 2.4273 2.5991 2.6981 2.9875 3.3617 3.4098 3.7655 3.9458 5.6890 7.5992 7.9548 8.3964 8.7716 9.2658 9.7638 10.4290 10.5780 10.6696 10.7972 11.2700 11.5186 11.7044 12.3465 12.5340 12.5994 13.6777 14.3007 14.4243 15.7146 16.9515 17.2877 17.4002 19.4855 20.8342 21.7299 21.9887 22.3746 22.9449 23.0773 23.1168 23.4845 23.5498 23.7224 23.8920 24.3922 24.5633 24.9014 25.1238 25.3074 25.5487 25.8848 26.1407 26.3497 26.7298 27.4610 27.8571 28.5882 28.8534 29.5249 30.1799 30.8610 31.6606 32.2318 33.8995 34.8953 36.2169 36.3514 37.8036 39.4172 40.0647 40.3804 42.1594 42.6090 43.9225 44.5405 45.0937 45.5824 46.3894 46.9870 48.4425 49.5444 49.6733 50.1635 50.5567 51.1231 51.3696 51.7966 52.2159 52.6948 54.8092 55.3187 55.6998 56.8561 57.9937 59.6018 59.7295 60.1677 60.5909 60.9236 61.5587 61.7438 61.9803 62.9197 63.1706 63.3834 66.2602 66.7398 67.9442 69.2639 69.7941 70.3056 70.7059 72.3778 77.3201 81.7202 83.2048 366.3817 367.7040 368.0758 374.4987 375.9858 377.7269 378.8550 520.3724 523.7982 889.0833 electronvolt
chargesum: 1.0000000
charge: -0.651110 0.974537 -0.236413 -0.450687 -0.351040 -0.640820 -0.382153 -0.639804 -0.331352 -0.645852 0.420158 0.273931 0.283812 0.272205 0.244381 0.238808 0.298014 0.256881 0.276015 0.257508 0.222272 0.280680 0.277712 0.241431 0.271952 0.238936
charge: -0.168884 0.296930 -0.060782 -0.058985 -0.137214 -0.364938 -0.147510 -0.367290 -0.143585 -0.368400 0.290004 0.148613 0.153393 0.159802 0.142801 0.139728 0.159210 0.138177 0.161123 0.149274 0.131188 0.153418 0.152137 0.141218 0.159754 0.140817
qa: -0.6511 0.9745 -0.2364 -0.4507 -0.3510 -0.6408 -0.3822 -0.6398 -0.3314 -0.6459 0.4202 0.2739 0.2838 0.2722 0.2444 0.2388 0.2980 0.2569 0.2760 0.2575 0.2223 0.2807 0.2777 0.2414 0.2720 0.2389
va: 3.0902 3.6973 1.1947 3.1948 3.6351 3.6743 3.6357 3.6670 3.6326 3.6778 0.8038 0.8844 0.8865 0.8938 0.9050 0.9065 0.8793 0.8937 0.8914 0.9002 0.9140 0.8858 0.8843 0.9068 0.8944 0.9053
dispersion: -0.013436486 hartree
energy: -484.482261076646 hartree
dipole: -1.99660 1.99725 0.00065 6.64815 -6.02408 0.62407 1.81635 -1.24127 0.57508
magnitude: 0.84864 au
magnitude: 2.15707 debye
temp: 298.15 k
press: 1.00 atm
zeropoint: 0.24141500 hartree
thermalvibcorrection: 0.00941954 hartree
thermalrotcorrection: 0.00141627 hartree
thermaltrasncorrection: 0.00141627 hartree
thermaltotal: -484.22859399 hartree
thermalcorr: 0.01225208 hartree
nonthermalcorr: 0.24141500 hartree
totalcorr: 0.25366708 hartree
thermalcorrenthalpy: 0.00094421 hartree
totalenthalpy: -484.22764978 hartree
vibrat: 0.01669730 hartree
rotat: 0.01434098 hartree
transl: 0.01941897 hartree
total: 0.05045724 hartree
totalentropycorr: -0.05045724 hartree
gibbsenthalpy: -484.27810703 hartree
gibbsminuselec: 0.20415405 hartree
