program: Orca
programVersion: 5.0.4
elementType: N C F N C C C C C C H H H H H H H H H H H H H H H H
charge: 1
multiplicity: 1
keywords: Opt RIJCOSX PBEh-3c
formula: C7H16FN2
InChI: InChI=1/C7H16FN2/c1-4-9-7(8)10(5-2)6-3/h9H,4-6H2,1-3H3
26 atoms
N  1.29852 -0.146888 0.702912
C  0.298459 -0.559923 -0.035936
F  0.535186 -1.617248 -0.759701
N  -0.89487 -0.042198 -0.112121
C  -1.927054 -0.583816 -1.019376
C  -2.820747 -1.599091 -0.334282
C  -1.267979 1.111608 0.716072
C  -0.870904 2.438555 0.093238
C  2.634807 -0.766814 0.743582
C  3.550668 -0.258827 -0.352917
H  1.181135 0.714307 1.213554
H  -2.502117 0.275876 -1.363191
H  -1.452606 -1.004963 -1.9027
H  -3.591163 -1.928288 -1.029956
H  -2.26479 -2.480129 -0.017174
H  -3.327231 -1.18098 0.535533
H  -2.348098 1.06081 0.844857
H  -0.855448 0.986973 1.719854
H  -1.207703 3.255598 0.729186
H  -1.33163 2.572988 -0.884645
H  0.207124 2.543648 -0.032159
H  2.522837 -1.848343 0.70525
H  3.036345 -0.533653 1.727935
H  3.182094 -0.517422 -1.344693
H  4.534015 -0.712932 -0.240497
H  3.68105 0.821551 -0.302824
totalener: -484.51800300 hartree
nucrepener: 596.40842416 hartree
electener: -1080.92642716 hartree
oneelecener: -1827.52977472 hartree
twoeener: 746.60334756 hartree
kineticenergy: 480.89398095 hartree
exchangeener: -36.285729971265 hartree
correlationener: -3.483865153246 hartree
xcener: -39.769595124511 hartree
dispersion: -0.013419905 hartree
dispersion: -0.013422502 hartree
dispersion: -0.013430298 hartree
dispersion: -0.013432758 hartree
energy: -689.3419 -404.8614 -404.6954 -294.4551 -289.8801 -289.5835 -289.5800 -288.0043 -287.6274 -287.5768 -43.3642 -35.2273 -33.4457 -28.2211 -28.0718 -27.0391 -25.1188 -24.2579 -24.0423 -23.5014 -22.3213 -21.2436 -20.9809 -19.7423 -19.1061 -19.0169 -18.3131 -18.0368 -17.7807 -17.5574 -17.2107 -16.4374 -16.0495 -15.6797 -15.5825 -15.4352 -15.1568 -15.0439 -15.0358 -13.0206 -3.7202 -1.7403 -0.8833 -0.1821 0.3802 0.5317 0.6994 0.7797 1.2372 1.4517 1.4868 1.6501 1.7355 1.9515 2.1589 2.2415 2.4273 2.5991 2.6982 2.9875 3.3617 3.4098 3.7656 3.9458 5.6890 7.5992 7.9548 8.3964 8.7716 9.2657 9.7638 10.4290 10.5782 10.6696 10.7972 11.2700 11.5186 11.7044 12.3466 12.5340 12.5995 13.6777 14.3008 14.4243 15.7147 16.9514 17.2877 17.4002 19.4853 20.8341 21.7300 21.9887 22.3745 22.9450 23.0773 23.1168 23.4845 23.5498 23.7223 23.8921 24.3921 24.5633 24.9014 25.1238 25.3074 25.5487 25.8848 26.1407 26.3497 26.7299 27.4610 27.8571 28.5881 28.8533 29.5249 30.1797 30.8608 31.6605 32.2317 33.8994 34.8954 36.2169 36.3513 37.8036 39.4172 40.0645 40.3805 42.1593 42.6090 43.9225 44.5404 45.0936 45.5825 46.3895 46.9870 48.4424 49.5445 49.6734 50.1635 50.5568 51.1230 51.3696 51.7966 52.2159 52.6949 54.8093 55.3188 55.6997 56.8560 57.9936 59.6019 59.7294 60.1677 60.5910 60.9236 61.5586 61.7438 61.9804 62.9197 63.1706 63.3834 66.2602 66.7397 67.9442 69.2640 69.7942 70.3056 70.7059 72.3778 77.3198 81.7201 83.2049 366.3817 367.7039 368.0758 374.4988 375.9857 377.7271 378.8551 520.3719 523.7984 889.0823 electronvolt
chargesum: 1.0000000
charge: -0.651071 0.974523 -0.236398 -0.450720 -0.351050 -0.640818 -0.382160 -0.639802 -0.331351 -0.645853 0.420151 0.273932 0.283817 0.272206 0.244383 0.238810 0.298016 0.256884 0.276017 0.257508 0.222273 0.280676 0.277709 0.241431 0.271950 0.238937
charge: -0.168851 0.296916 -0.060769 -0.059010 -0.137219 -0.364937 -0.147513 -0.367289 -0.143584 -0.368401 0.289999 0.148614 0.153395 0.159803 0.142802 0.139729 0.159210 0.138179 0.161124 0.149274 0.131188 0.153416 0.152136 0.141217 0.159753 0.140817
qa: -0.6511 0.9745 -0.2364 -0.4507 -0.3510 -0.6408 -0.3822 -0.6398 -0.3314 -0.6459 0.4202 0.2739 0.2838 0.2722 0.2444 0.2388 0.2980 0.2569 0.2760 0.2575 0.2223 0.2807 0.2777 0.2414 0.2720 0.2389
va: 3.0902 3.6974 1.1947 3.1948 3.6351 3.6743 3.6356 3.6670 3.6326 3.6778 0.8038 0.8844 0.8865 0.8938 0.9050 0.9065 0.8793 0.8937 0.8914 0.9002 0.9140 0.8858 0.8843 0.9068 0.8944 0.9053
dispersion: -0.013436486 hartree
energy: -484.482261046108 hartree
dipole: -1.99660 1.99732 0.00073 6.64815 -6.02410 0.62406 1.81635 -1.24125 0.57510
magnitude: 0.84864 au
magnitude: 2.15707 debye
