program: Orca
programVersion: 5.0.4
elementType: N C C C F F N C C C C H H H H H H H H H H H H H H H H
charge: 0
multiplicity: 1
keywords: Freq RIJCOSX PBEh-3c
frequency: 0.00 0.00 0.00 0.00 0.00 0.00 43.42 64.64 70.15 99.80 120.82 161.42 215.91 226.97 243.44 275.41 311.03 318.64 352.61 391.80 441.12 457.57 524.21 575.25 586.46 677.10 720.35 744.88 808.20 810.23 833.77 940.99 964.35 969.42 1066.01 1099.56 1116.42 1128.06 1134.97 1158.90 1166.11 1184.64 1231.46 1269.59 1296.73 1348.92 1373.61 1383.32 1426.50 1439.50 1454.76 1469.60 1473.18 1476.56 1485.69 1536.76 1544.41 1546.49 1547.33 1550.30 1553.12 1558.17 1561.22 1565.97 1578.61 3088.99 3116.35 3119.06 3119.71 3122.96 3134.28 3179.99 3183.85 3189.65 3195.80 3200.44 3204.30 3211.94 3223.07 3224.97 3647.20
frequency: 43.42 64.64 70.15 99.80 120.82 161.42 215.91 226.97 243.44 275.41 311.03 318.64 352.61 391.80 441.12 457.57 524.21 575.25 586.46 677.10 720.35 744.88 808.20 810.23 833.77 940.99 964.35 969.42 1066.01 1099.56 1116.42 1128.06 1134.97 1158.90 1166.11 1184.64 1231.46 1269.59 1296.73 1348.92 1373.61 1383.32 1426.50 1439.50 1454.76 1469.60 1473.18 1476.56 1485.69 1536.76 1544.41 1546.49 1547.33 1550.30 1553.12 1558.17 1561.22 1565.97 1578.61 3088.99 3116.35 3119.06 3119.71 3122.96 3134.28 3179.99 3183.85 3189.65 3195.80 3200.44 3204.30 3211.94 3223.07 3224.97 3647.20
formula: C7H16F2N2
InChI: InChI=1/C7H16F2N2/c1-4-10-7(8,9)11(5-2)6-3/h10H,4-6H2,1-3H3
27 atoms
N  1.434376 0.005495 1.029389
C  2.12141 -0.949797 0.17811
C  3.374321 -0.422415 -0.509748
C  0.490437 0.869384 0.460127
F  1.006654 1.661804 -0.540832
F  0.16612 1.782486 1.444563
N  -0.616464 0.189685 -0.064366
C  -1.453954 0.863862 -1.046327
C  -2.226191 2.084144 -0.552997
C  -1.339784 -0.680771 0.8548
C  -1.585384 -2.061484 0.267206
H  2.055948 0.493236 1.659188
H  2.385039 -1.814093 0.792635
H  1.408438 -1.311188 -0.563047
H  3.149621 0.386408 -1.202291
H  3.862775 -1.219836 -1.071288
H  4.098255 -0.050426 0.217859
H  -2.163991 0.116228 -1.405685
H  -0.854772 1.131346 -1.915749
H  -2.812911 1.861543 0.339209
H  -2.920239 2.418707 -1.324899
H  -1.566766 2.917652 -0.318914
H  -0.767891 -0.783383 1.774879
H  -2.294673 -0.223386 1.13794
H  -0.644386 -2.575416 0.073135
H  -2.139606 -2.0169 -0.671383
H  -2.166383 -2.672882 0.958686
totalener: -584.41290795 hartree
nucrepener: 740.59855289 hartree
electener: -1325.01146084 hartree
oneelecener: -2270.76867584 hartree
twoeener: 945.75721499 hartree
kineticenergy: 580.25434424 hartree
exchangeener: -42.089462113075 hartree
correlationener: -3.964132091130 hartree
xcener: -46.053594204205 hartree
energy: -682.6349 -682.5112 -398.3398 -398.2214 -289.6266 -284.8142 -284.7283 -284.6950 -283.6620 -283.6557 -283.5078 -37.1332 -35.2259 -28.7100 -27.3684 -23.1474 -23.0311 -22.2418 -20.0849 -19.4127 -19.1729 -17.6387 -16.9861 -16.5121 -16.0723 -14.4780 -14.3867 -13.9104 -13.4163 -13.3289 -13.1737 -12.8990 -12.7786 -12.4586 -12.2345 -12.1031 -11.6629 -11.5549 -11.3183 -11.2705 -10.7683 -10.6520 -10.4829 -8.1746 -7.6167 3.5484 3.8844 4.3578 4.6874 4.8172 5.0340 5.3313 5.4482 5.5290 5.6389 5.7461 6.0219 6.1593 6.2669 6.2728 6.3964 6.5873 6.8769 7.1994 7.4691 7.8037 8.0595 8.5369 8.8142 10.5399 11.0028 12.5089 13.2630 13.4030 13.6729 14.5766 14.6709 14.8252 15.0311 15.2641 15.7770 15.9134 16.3169 16.6288 17.2910 17.5029 17.9955 18.9349 19.9125 20.8887 21.2656 22.2873 23.5780 24.5320 25.1585 25.5967 26.5790 27.0305 27.1187 27.3132 27.5946 27.8486 27.9865 28.1284 28.3674 28.5551 28.7484 28.9803 29.0944 29.2810 29.8865 29.9596 30.3731 30.8824 31.2222 31.4049 32.3848 32.7493 33.7945 34.2015 34.5983 35.1273 35.5342 35.7687 36.2021 36.8059 37.6063 38.4948 39.0796 39.2496 40.0481 41.6555 42.2144 43.3720 44.7949 45.0573 45.3824 46.6633 47.0637 47.4149 49.0548 49.5780 50.3773 51.3116 51.5870 52.3977 53.0828 54.3162 54.4326 55.0515 55.2539 55.9543 56.1816 57.2356 57.7430 58.0627 58.7905 59.6243 59.8537 60.3661 61.0518 62.6929 63.2908 64.2558 64.4479 64.5721 65.2762 65.9486 66.0820 66.3965 67.3837 67.8422 68.7696 70.2860 71.1030 72.0645 73.5561 73.6925 74.6691 76.5757 77.2994 79.9003 81.2219 83.3317 85.4220 87.1513 371.3652 372.0941 372.9874 379.1274 380.3807 382.9309 384.6408 526.2303 527.9368 895.6216 900.9136 electronvolt
chargesum: 0.0000000
charge: -0.660058 -0.306170 -0.647863 1.022163 -0.348735 -0.354208 -0.505302 -0.302720 -0.654191 -0.294575 -0.634844 0.344879 0.217895 0.238330 0.237611 0.213850 0.204327 0.214986 0.242883 0.214464 0.212212 0.236871 0.251050 0.211516 0.220784 0.211203 0.213640
charge: -0.279412 -0.163460 -0.380826 0.285577 -0.191764 -0.200836 -0.175399 -0.152121 -0.379378 -0.149449 -0.366854 0.248706 0.118500 0.133954 0.135321 0.128691 0.121506 0.120886 0.130213 0.125048 0.127189 0.134893 0.140340 0.111718 0.127413 0.122567 0.126973
qa: -0.6601 -0.3062 -0.6479 1.0222 -0.3487 -0.3542 -0.5053 -0.3027 -0.6542 -0.2946 -0.6348 0.3449 0.2179 0.2383 0.2376 0.2138 0.2043 0.2150 0.2429 0.2145 0.2122 0.2369 0.2511 0.2115 0.2208 0.2112 0.2136
va: 2.9136 3.7636 3.7176 3.9594 1.0545 1.0453 2.9792 3.7691 3.7165 3.7100 3.7323 0.8556 0.9044 0.9122 0.9135 0.9134 0.9165 0.9087 0.9039 0.9157 0.9126 0.9116 0.9113 0.9049 0.9130 0.9167 0.9134
dispersion: -0.014740664 hartree
energy: -584.365224648176 hartree
dipole: -4.34303 4.36661 0.02359 -11.17711 10.54279 -0.63432 -4.23566 4.16808 -0.06758
magnitude: 0.63834 au
magnitude: 1.62254 debye
temp: 298.15 k
press: 1.00 atm
zeropoint: 0.24339716 hartree
thermalvibcorrection: 0.01005716 hartree
thermalrotcorrection: 0.00141627 hartree
thermaltrasncorrection: 0.00141627 hartree
thermaltotal: -584.10893778 hartree
thermalcorr: 0.01288971 hartree
nonthermalcorr: 0.24339716 hartree
totalcorr: 0.25628687 hartree
thermalcorrenthalpy: 0.00094421 hartree
totalenthalpy: -584.10799357 hartree
vibrat: 0.01759241 hartree
rotat: 0.01444689 hartree
transl: 0.01959087 hartree
total: 0.05163016 hartree
totalentropycorr: -0.05163016 hartree
gibbsenthalpy: -584.15962374 hartree
gibbsminuselec: 0.20560091 hartree
