program: Orca
programVersion: 5.0.4
elementType: N C C C F F N C C C C H H H H H H H H H H H H H H H H
charge: 0
multiplicity: 1
keywords: Opt RIJCOSX PBEh-3c
formula: C7H16F2N2
InChI: InChI=1/C7H16F2N2/c1-4-10-7(8,9)11(5-2)6-3/h10H,4-6H2,1-3H3
27 atoms
N  1.434376 0.005495 1.029389
C  2.12141 -0.949797 0.17811
C  3.374321 -0.422415 -0.509748
C  0.490437 0.869384 0.460127
F  1.006654 1.661804 -0.540832
F  0.16612 1.782486 1.444563
N  -0.616464 0.189685 -0.064366
C  -1.453954 0.863862 -1.046327
C  -2.226191 2.084144 -0.552997
C  -1.339784 -0.680771 0.8548
C  -1.585384 -2.061484 0.267206
H  2.055948 0.493236 1.659188
H  2.385039 -1.814093 0.792635
H  1.408438 -1.311188 -0.563047
H  3.149621 0.386408 -1.202291
H  3.862775 -1.219836 -1.071288
H  4.098255 -0.050426 0.217859
H  -2.163991 0.116228 -1.405685
H  -0.854772 1.131346 -1.91575
H  -2.812911 1.861543 0.339209
H  -2.920239 2.418707 -1.324899
H  -1.566766 2.917652 -0.318914
H  -0.767891 -0.783383 1.774879
H  -2.294673 -0.223386 1.13794
H  -0.644386 -2.575416 0.073135
H  -2.139606 -2.0169 -0.671383
H  -2.166383 -2.672882 0.958686
totalener: -584.41290917 hartree
nucrepener: 740.49672125 hartree
electener: -1324.90963042 hartree
oneelecener: -2270.56261486 hartree
twoeener: 945.65298444 hartree
kineticenergy: 580.25109790 hartree
exchangeener: -42.089487149343 hartree
correlationener: -3.964242916454 hartree
xcener: -46.053730065797 hartree
dispersion: -0.014733381 hartree
dispersion: -0.014733624 hartree
dispersion: -0.014739302 hartree
dispersion: -0.014744244 hartree
dispersion: -0.014752363 hartree
dispersion: -0.014752514 hartree
dispersion: -0.014744317 hartree
dispersion: -0.014742324 hartree
energy: -682.6353 -682.5118 -398.3396 -398.2215 -289.6266 -284.8145 -284.7285 -284.6954 -283.6618 -283.6557 -283.5076 -37.1333 -35.2261 -28.7101 -27.3684 -23.1474 -23.0311 -22.2418 -20.0850 -19.4128 -19.1729 -17.6388 -16.9861 -16.5122 -16.0724 -14.4781 -14.3868 -13.9105 -13.4163 -13.3290 -13.1738 -12.8991 -12.7786 -12.4586 -12.2346 -12.1032 -11.6629 -11.5550 -11.3183 -11.2706 -10.7683 -10.6520 -10.4829 -8.1747 -7.6167 3.5484 3.8844 4.3577 4.6874 4.8172 5.0340 5.3313 5.4481 5.5290 5.6389 5.7461 6.0219 6.1593 6.2669 6.2728 6.3964 6.5873 6.8768 7.1994 7.4691 7.8037 8.0594 8.5369 8.8142 10.5399 11.0028 12.5089 13.2629 13.4030 13.6729 14.5766 14.6709 14.8252 15.0310 15.2641 15.7769 15.9134 16.3169 16.6288 17.2910 17.5029 17.9954 18.9349 19.9124 20.8886 21.2656 22.2872 23.5780 24.5319 25.1584 25.5967 26.5790 27.0305 27.1187 27.3131 27.5946 27.8486 27.9864 28.1283 28.3674 28.5551 28.7484 28.9803 29.0944 29.2810 29.8865 29.9596 30.3731 30.8824 31.2222 31.4048 32.3847 32.7492 33.7944 34.2015 34.5982 35.1272 35.5341 35.7686 36.2021 36.8059 37.6062 38.4947 39.0795 39.2496 40.0480 41.6555 42.2143 43.3720 44.7948 45.0572 45.3824 46.6632 47.0636 47.4148 49.0548 49.5780 50.3772 51.3116 51.5870 52.3976 53.0828 54.3162 54.4325 55.0514 55.2538 55.9543 56.1816 57.2356 57.7429 58.0626 58.7905 59.6242 59.8537 60.3661 61.0518 62.6928 63.2908 64.2557 64.4478 64.5721 65.2762 65.9486 66.0820 66.3964 67.3836 67.8422 68.7696 70.2860 71.1029 72.0644 73.5560 73.6925 74.6691 76.5756 77.2993 79.9002 81.2219 83.3316 85.4219 87.1511 371.3651 372.0942 372.9874 379.1273 380.3807 382.9307 384.6408 526.2302 527.9369 895.6213 900.9132 electronvolt
chargesum: 0.0000000
charge: -0.660051 -0.306150 -0.647881 1.022151 -0.348732 -0.354200 -0.505308 -0.302707 -0.654204 -0.294554 -0.634845 0.344878 0.217889 0.238325 0.237612 0.213850 0.204333 0.214982 0.242881 0.214469 0.212212 0.236874 0.251046 0.211510 0.220782 0.211203 0.213638
charge: -0.279409 -0.163448 -0.380837 0.285569 -0.191761 -0.200830 -0.175406 -0.152110 -0.379388 -0.149433 -0.366856 0.248706 0.118497 0.133950 0.135322 0.128691 0.121509 0.120883 0.130211 0.125051 0.127190 0.134895 0.140337 0.111714 0.127411 0.122567 0.126972
qa: -0.6601 -0.3062 -0.6479 1.0222 -0.3487 -0.3542 -0.5053 -0.3027 -0.6542 -0.2946 -0.6348 0.3449 0.2179 0.2383 0.2376 0.2138 0.2043 0.2150 0.2429 0.2145 0.2122 0.2369 0.2510 0.2115 0.2208 0.2112 0.2136
va: 2.9136 3.7636 3.7176 3.9594 1.0545 1.0453 2.9792 3.7691 3.7165 3.7100 3.7323 0.8556 0.9044 0.9122 0.9135 0.9134 0.9165 0.9087 0.9040 0.9157 0.9126 0.9116 0.9113 0.9049 0.9130 0.9167 0.9134
dispersion: -0.014740664 hartree
energy: -584.365224658606 hartree
dipole: -4.34303 4.36662 0.02359 -11.17711 10.54283 -0.63428 -4.23566 4.16815 -0.06751
magnitude: 0.63830 au
magnitude: 1.62243 debye
