program: Orca
programVersion: 5.0.4
elementType: N C C C N C C C C H H H H H H H H H H H H H H H H
charge: 2
multiplicity: 1
keywords: SP DSD-BLYP D3BJ def2-QZVPP def2-QZVPP/C def2/J TightSCF
formula: C7H16N2
InChI: InChI=1/C7H16N2/c1-4-8-7-9(5-2)6-3/h8H,4-6H2,1-3H3
25 atoms
N  1.18687 -0.319741 0.628337
C  2.342393 -0.596911 -0.342972
C  3.43112 0.428111 -0.140674
C  0.009615 -0.119092 0.321484
N  -1.15498 0.07258 -0.006593
C  -2.148634 -1.087155 -0.104115
C  -1.5404 -2.426723 0.209808
C  -1.672084 1.477527 -0.316691
C  -0.609829 2.53946 -0.232535
H  1.43643 -0.281368 1.625899
H  1.914634 -0.587426 -1.34373
H  2.657039 -1.610261 -0.091344
H  4.237431 0.176652 -0.831406
H  3.105233 1.439636 -0.374557
H  3.854932 0.400417 0.8626
H  -2.943626 -0.804497 0.587442
H  -2.525321 -1.01837 -1.125642
H  -1.184881 -2.507266 1.237505
H  -2.329301 -3.172353 0.10368
H  -0.756268 -2.714553 -0.491274
H  -2.10038 1.380892 -1.315281
H  -2.4790 1.621494 0.403246
H  -1.082938 3.491312 -0.476684
H  -0.197048 2.65498 0.770064
H  0.187978 2.400794 -0.96297
totalener: -384.02227659 hartree
nucrepener: 472.60168659 hartree
electener: -856.62396318 hartree
oneelecener: -1429.25269920 hartree
twoeener: 572.62873602 hartree
kineticenergy: 382.95928350 hartree
exchangeener: -16.978578877751 hartree
correlationener: -1.238404063370 hartree
xcener: -18.216982941122 hartree
chargesum: 2.0000000
charge: -0.125645 0.067669 -0.123071 0.452253 -0.115714 0.055778 -0.138297 0.053327 -0.146096 0.295807 0.112165 0.154654 0.128047 0.080691 0.080197 0.151235 0.150239 0.069401 0.138022 0.072810 0.150232 0.151855 0.142108 0.070964 0.071367
charge: 0.677513 0.151042 0.285307 -0.017318 0.505977 0.148003 0.278193 0.147235 0.277175 -0.040141 -0.027339 -0.019066 -0.018294 -0.046725 -0.040879 -0.013087 -0.013813 -0.044307 -0.013004 -0.045502 -0.013715 -0.013006 -0.013110 -0.044535 -0.046605
qa: -0.1256 0.0677 -0.1231 0.4523 -0.1157 0.0558 -0.1383 0.0533 -0.1461 0.2958 0.1122 0.1547 0.1280 0.0807 0.0802 0.1512 0.1502 0.0694 0.1380 0.0728 0.1502 0.1519 0.1421 0.0710 0.0714
va: 3.4211 3.6621 3.8776 3.7771 3.3878 3.6769 3.8890 3.6781 3.8905 0.9397 0.9747 0.9720 0.9994 1.0025 0.9997 0.9700 0.9687 0.9971 1.0005 0.9986 0.9689 0.9700 0.9994 0.9961 0.9997
total: -384.849691974 hartree
dispersion: -0.012157193 hartree
energy: -384.861849166752 hartree
dipole: 1.68411 -1.70128 -0.01717 0.81493 -1.02810 -0.21318 -1.33108 1.71054 0.37946
magnitude: 0.43558 au
magnitude: 1.10716 debye
