program: Orca
programVersion: 5.0.4
elementType: C C N C C C F N C C C C H H H H H H H H H H H H H H H H H H H H
charge: 1
multiplicity: 1
keywords: Opt RIJCOSX PBEh-3c
formula: C9H20FN2
InChI: InChI=1/C9H20FN2/c1-5-11(6-2)9(10)12(7-3)8-4/h5-8H2,1-4H3
32 atoms
C  -2.014056 1.812806 -1.064424
C  -1.295643 1.40219 0.208341
N  -1.159817 -0.050951 0.379576
C  -2.390941 -0.74073 0.830932
C  -2.569904 -0.713581 2.337811
C  -0.029611 -0.712085 0.326511
F  -0.078759 -1.905066 0.875336
N  1.141212 -0.400943 -0.173428
C  1.380016 0.649451 -1.173966
C  2.155736 1.844281 -0.64994
C  2.309781 -1.265512 0.110961
C  2.446005 -2.425665 -0.858463
H  -1.493357 1.494811 -1.966984
H  -3.027336 1.417221 -1.112532
H  -2.093512 2.898447 -1.092512
H  -1.854061 1.755654 1.076942
H  -0.317904 1.868364 0.28385
H  -3.215817 -0.224694 0.342508
H  -2.403958 -1.757898 0.445662
H  -1.793918 -1.272241 2.857311
H  -2.583247 0.302931 2.730091
H  -3.526916 -1.167225 2.59142
H  1.942383 0.171787 -1.978118
H  0.434808 0.947438 -1.618608
H  1.636121 2.373854 0.147643
H  3.137588 1.56335 -0.272148
H  2.317135 2.548288 -1.464937
H  2.267571 -1.61121 1.141698
H  3.181302 -0.615744 0.04913
H  3.37061 -2.960162 -0.645352
H  1.627637 -3.136948 -0.770239
H  2.500953 -2.090218 -1.893971
totalener: -562.97361525 hartree
nucrepener: 816.72928180 hartree
electener: -1379.70289705 hartree
oneelecener: -2369.86544792 hartree
twoeener: 990.16255087 hartree
kineticenergy: 558.66181651 hartree
exchangeener: -42.848474975985 hartree
correlationener: -4.170101012107 hartree
xcener: -47.018575988091 hartree
dispersion: -0.018612098 hartree
dispersion: -0.018617513 hartree
dispersion: -0.018614875 hartree
energy: -688.8861 -404.5926 -404.5807 -294.1023 -289.5812 -289.5774 -289.3371 -289.3342 -287.7482 -287.7480 -287.4632 -287.4562 -42.8819 -34.8147 -33.4106 -28.1903 -27.7657 -27.6505 -26.7543 -24.7340 -24.1668 -23.9853 -23.4322 -22.5768 -21.0587 -20.8401 -20.7761 -19.1834 -19.0641 -18.6303 -18.5300 -17.8624 -17.7302 -17.6378 -17.1885 -16.9768 -16.1579 -16.1459 -15.9275 -15.7509 -15.4862 -15.4612 -15.1235 -14.9672 -14.8190 -14.7979 -14.6893 -12.5474 -3.6754 -0.7993 -0.6740 -0.0940 0.0977 0.3201 0.3360 0.9706 0.9833 1.1662 1.2618 1.2738 1.4699 1.7385 1.9441 2.1392 2.1993 2.4268 2.7094 2.7175 2.7724 2.9933 3.1298 3.1433 3.5775 3.9636 4.2292 4.2729 4.6963 5.2354 5.7894 7.6170 8.2260 8.4767 9.0811 9.3523 9.8256 10.4497 10.5050 10.8806 11.0304 11.0839 11.4041 11.6350 11.9984 12.2547 12.5512 12.8490 13.1690 13.5153 13.6567 14.3785 14.4412 15.1711 16.0906 16.1050 17.1496 17.6814 18.4413 20.3158 21.6331 21.7412 21.8228 22.7628 22.8081 23.1596 23.3832 23.5811 23.6199 23.9014 24.4596 24.5702 24.7536 24.8516 25.1933 25.2621 25.3719 25.6335 25.9621 26.2691 26.2876 26.7588 26.9278 27.2926 27.3618 27.9582 29.0181 29.1621 29.4380 30.0701 30.3848 31.1688 31.1944 31.8914 31.9562 32.6143 33.9289 34.8779 35.3102 35.4651 37.9290 39.1638 39.6899 41.2813 41.3148 42.8754 43.0086 43.8071 44.6471 45.2180 45.6255 45.7836 46.4840 46.8408 48.2459 48.5258 49.4805 50.0334 50.2037 50.3820 50.5672 51.0168 51.3356 52.1874 52.6226 52.9228 53.2664 54.5422 54.9481 55.7509 55.8933 56.7494 57.8442 59.3347 59.7399 60.4540 60.7404 61.0718 61.2473 61.3078 61.9517 62.1729 62.3655 62.5903 62.7773 63.4347 64.0914 65.6483 67.4081 67.7505 68.2315 69.2953 69.5232 70.1930 71.5503 73.2344 73.6920 78.2252 82.6032 84.9106 366.7992 367.5675 368.7187 368.7534 374.8109 375.8217 378.0959 378.7062 379.2782 521.8242 524.7831 889.4948 electronvolt
chargesum: 1.0000000
charge: -0.647792 -0.373228 -0.456632 -0.348809 -0.645583 0.958155 -0.253565 -0.457390 -0.373746 -0.647968 -0.348486 -0.646268 0.237217 0.251597 0.270223 0.291208 0.268284 0.269415 0.281326 0.245193 0.235838 0.270169 0.291339 0.268605 0.237676 0.251437 0.270290 0.280927 0.269108 0.269888 0.245640 0.235928
charge: -0.365259 -0.142728 -0.063590 -0.137514 -0.366335 0.297541 -0.077674 -0.064656 -0.142700 -0.365439 -0.137647 -0.366685 0.133744 0.143900 0.158879 0.152237 0.141941 0.146232 0.151427 0.141845 0.137543 0.158606 0.152398 0.141954 0.133723 0.143926 0.158929 0.151156 0.146193 0.158474 0.141963 0.137617
qa: -0.6478 -0.3732 -0.4566 -0.3488 -0.6456 0.9582 -0.2536 -0.4574 -0.3737 -0.6480 -0.3485 -0.6463 0.2372 0.2516 0.2702 0.2912 0.2683 0.2694 0.2813 0.2452 0.2358 0.2702 0.2913 0.2686 0.2377 0.2514 0.2703 0.2809 0.2691 0.2699 0.2456 0.2359
va: 3.6703 3.6231 3.1926 3.6365 3.6776 3.6825 1.1707 3.1905 3.6244 3.6701 3.6376 3.6775 0.9091 0.9033 0.8934 0.8765 0.8920 0.8894 0.8873 0.9070 0.9078 0.8945 0.8763 0.8918 0.9090 0.9033 0.8933 0.8870 0.8898 0.8947 0.9071 0.9077
dispersion: -0.018615954 hartree
energy: -562.930986703650 hartree
dipole: 0.35095 -0.33106 0.01989 8.36841 -7.84125 0.52716 -3.84037 3.59921 -0.24116
magnitude: 0.58005 au
magnitude: 1.47436 debye
