program: Orca
programVersion: 5.0.4
elementType: C C N C C C F F N C C C C H H H H H H H H H H H H H H H H H H H H
charge: 0
multiplicity: 1
keywords: Opt RIJCOSX PBEh-3c
formula: C9H20F2N2
InChI: InChI=1/C9H20F2N2/c1-5-12(6-2)9(10,11)13(7-3)8-4/h5-8H2,1-4H3
33 atoms
C  -1.533339 -0.367205 -2.300137
C  -1.081129 -1.01023 -1.000219
N  -1.227638 -0.108856 0.132598
C  -2.604375 0.128907 0.561459
C  -3.031771 1.579497 0.409001
C  -0.247236 -0.199342 1.13153
F  -0.293295 -1.405516 1.800027
F  -0.562841 0.713717 2.115133
N  1.058431 -0.028093 0.648771
C  1.317817 1.194492 -0.095882
C  2.297541 0.968986 -1.235085
C  2.152593 -0.478466 1.505398
C  2.71658 -1.826794 1.089302
H  -0.946231 0.524755 -2.521378
H  -2.583695 -0.073818 -2.270471
H  -1.415396 -1.065089 -3.129662
H  -0.033122 -1.291963 -1.085483
H  -1.639928 -1.940806 -0.833783
H  -3.254652 -0.502844 -0.048085
H  -2.766808 -0.204385 1.589103
H  -2.919206 1.913966 -0.622711
H  -4.078625 1.704198 0.690231
H  -2.436346 2.236216 1.040491
H  1.69741 1.984371 0.565628
H  0.375149 1.557653 -0.501562
H  1.915598 0.224355 -1.933926
H  2.46278 1.896899 -1.783347
H  3.270371 0.625418 -0.880311
H  2.944758 0.272423 1.455529
H  1.853284 -0.505911 2.555698
H  3.072169 -1.800522 0.058942
H  1.964712 -2.610093 1.165465
H  3.556238 -2.10602 1.727738
totalener: -662.86791740 hartree
nucrepener: 977.01058991 hartree
electener: -1639.87850731 hartree
oneelecener: -2847.07441614 hartree
twoeener: 1207.19590883 hartree
kineticenergy: 658.03361013 hartree
exchangeener: -48.653802051202 hartree
correlationener: -4.648104474091 hartree
xcener: -53.301906525293 hartree
dispersion: -0.019728462 hartree
energy: -682.5789 -682.5683 -398.3317 -398.3274 -289.5987 -284.7473 -284.7397 -284.7371 -284.7314 -283.7362 -283.7300 -283.5105 -283.5025 -37.1311 -35.2216 -28.8300 -27.6469 -23.2259 -23.1728 -23.0977 -22.0559 -20.0853 -19.3389 -19.2539 -18.4170 -17.6703 -16.6356 -16.3776 -16.1136 -14.6237 -14.4864 -13.9963 -13.8179 -13.6100 -13.0600 -13.0223 -12.9707 -12.9495 -12.2868 -12.2386 -11.9768 -11.8957 -11.8412 -11.6180 -11.4726 -11.2573 -11.1308 -10.7788 -10.6278 -10.4940 -10.4808 -7.8063 -7.4488 3.1366 4.0310 4.2470 4.4131 4.5581 4.6564 4.7314 4.9352 5.3861 5.4802 5.5646 5.6183 5.6667 5.9539 5.9863 6.0191 6.2216 6.3166 6.6580 6.6631 6.9337 7.0069 7.2661 7.2870 7.7224 7.7958 8.1130 8.1911 8.6641 9.0932 10.6794 10.9847 12.2792 12.7644 13.7304 13.7457 14.1565 14.1858 14.5024 14.9356 14.9581 15.5409 15.9010 15.9999 16.2112 16.2852 16.5762 17.1611 17.6193 17.8371 18.1159 18.6675 19.1693 19.7515 19.8805 20.4238 21.6826 22.4323 24.0615 24.4084 25.6067 25.8059 26.0595 26.5599 27.1447 27.1945 27.2900 27.3820 27.7125 27.7699 27.8543 27.9305 28.3736 28.4693 28.4715 29.0090 29.1481 29.2931 29.4005 29.5987 30.0424 30.3311 30.5177 30.6782 31.2086 31.4891 32.0082 32.3099 32.6453 32.8514 33.8945 34.2070 34.3592 35.4139 35.7179 36.3913 36.6090 37.3111 37.9073 38.9079 39.2403 39.7182 40.6544 41.3882 41.5559 42.3758 43.1781 44.1380 45.4849 46.2218 46.6005 46.8940 47.7052 48.2786 48.9944 49.4195 49.6019 50.4900 51.2638 52.7920 53.3595 53.7520 54.4203 54.8792 55.0847 55.3262 55.8383 56.1194 56.6963 56.9018 57.1337 57.5655 58.1028 58.2982 59.6344 59.6959 60.1234 60.7912 61.2750 61.8595 63.0504 63.6967 64.2753 64.9316 65.3338 65.8073 65.8550 66.1487 66.2681 66.4934 66.7878 66.8135 67.9448 69.5261 70.1178 70.5832 72.1345 72.7155 73.6980 75.0099 75.1423 76.0622 77.2348 77.9994 81.1373 82.7573 84.7193 85.9776 88.0230 371.3324 372.1156 372.8484 372.9165 378.9160 380.0845 382.1738 382.4906 384.6076 528.3510 528.9403 895.9926 901.8337 electronvolt
chargesum: -0.0000000
charge: -0.646864 -0.305456 -0.519773 -0.296388 -0.629769 1.067495 -0.352957 -0.352218 -0.518392 -0.306237 -0.646359 -0.296043 -0.629630 0.219689 0.215831 0.218174 0.248334 0.212390 0.212766 0.239844 0.212316 0.206018 0.231453 0.212127 0.248713 0.219643 0.217980 0.215597 0.212557 0.239490 0.212240 0.231557 0.205874
charge: -0.368196 -0.151935 -0.176656 -0.145519 -0.369257 0.296542 -0.193870 -0.192877 -0.176331 -0.152252 -0.368281 -0.145607 -0.369251 0.127251 0.124318 0.128779 0.136113 0.109634 0.120202 0.129205 0.124063 0.124171 0.133196 0.109546 0.136280 0.127260 0.128667 0.124213 0.120057 0.129140 0.124017 0.133270 0.124105
qa: -0.6469 -0.3055 -0.5198 -0.2964 -0.6298 1.0675 -0.3530 -0.3522 -0.5184 -0.3062 -0.6464 -0.2960 -0.6296 0.2197 0.2158 0.2182 0.2483 0.2124 0.2128 0.2398 0.2123 0.2060 0.2315 0.2121 0.2487 0.2196 0.2180 0.2156 0.2126 0.2395 0.2122 0.2316 0.2059
va: 3.7301 3.7289 2.9487 3.7397 3.7265 3.9249 1.0498 1.0508 2.9491 3.7286 3.7301 3.7401 3.7266 0.9140 0.9138 0.9123 0.9128 0.9019 0.9099 0.9057 0.9160 0.9157 0.9145 0.9021 0.9128 0.9141 0.9123 0.9139 0.9099 0.9059 0.9160 0.9146 0.9157
dispersion: -0.019729189 hartree
energy: -662.814382749530 hartree
dipole: 3.31249 -3.17754 0.13495 2.67601 -2.55870 0.11731 -15.17309 14.52626 -0.64683
magnitude: 0.67109 au
magnitude: 1.70578 debye
