program: Orca
programVersion: 5.0.4
elementType: C C N C C C N C C C C H H H H H H H H H H H H H H H H H H H H
charge: 2
multiplicity: 1
keywords: Freq RIJCOSX PBEh-3c
frequency: 0.00 0.00 0.00 0.00 0.00 0.00 46.95 55.84 70.36 74.30 95.00 105.01 113.02 163.12 219.13 233.73 262.75 290.41 299.81 318.52 367.42 375.15 394.66 428.82 504.95 588.93 623.85 640.12 747.87 804.60 816.85 825.83 836.45 919.79 929.22 996.01 1005.59 1006.47 1022.08 1127.33 1140.14 1143.87 1153.39 1160.49 1179.90 1194.71 1195.79 1302.72 1319.91 1336.96 1357.88 1361.23 1392.10 1404.70 1416.18 1467.68 1471.13 1472.48 1474.38 1498.30 1504.67 1511.53 1523.94 1528.00 1531.33 1532.22 1535.29 1536.35 1538.46 1539.47 1542.42 1569.82 2284.27 3122.94 3123.12 3124.40 3135.79 3147.34 3152.62 3153.47 3155.01 3206.42 3208.94 3209.31 3216.21 3217.75 3218.27 3220.28 3221.88 3223.70 3225.34 3227.74 3246.65
frequency: 46.95 55.84 70.36 74.30 95.00 105.01 113.02 163.12 219.13 233.73 262.75 290.41 299.81 318.52 367.42 375.15 394.66 428.82 504.95 588.93 623.85 640.12 747.87 804.60 816.85 825.83 836.45 919.79 929.22 996.01 1005.59 1006.47 1022.08 1127.33 1140.14 1143.87 1153.39 1160.49 1179.90 1194.71 1195.79 1302.72 1319.91 1336.96 1357.88 1361.23 1392.10 1404.70 1416.18 1467.68 1471.13 1472.48 1474.38 1498.30 1504.67 1511.53 1523.94 1528.00 1531.33 1532.22 1535.29 1536.35 1538.46 1539.47 1542.42 1569.82 2284.27 3122.94 3123.12 3124.40 3135.79 3147.34 3152.62 3153.47 3155.01 3206.42 3208.94 3209.31 3216.21 3217.75 3218.27 3220.28 3221.88 3223.70 3225.34 3227.74 3246.65
formula: C9H20N2
InChI: InChI=1/C9H20N2/c1-5-10(6-2)9-11(7-3)8-4/h5-8H2,1-4H3
31 atoms
C  -1.21863 -1.947913 -1.231312
C  -1.932317 -0.841073 -0.500532
N  -0.997156 0.081989 0.251836
C  -1.602935 1.16285 1.144545
C  -2.431451 2.141978 0.345863
C  0.222973 -0.026983 0.153855
N  1.447675 -0.118152 0.076466
C  2.235683 -0.987629 1.039163
C  1.383019 -1.641299 2.093844
C  2.225628 0.62449 -0.993537
C  1.362465 1.489857 -1.87301
H  -1.974194 -2.559026 -1.724945
H  -0.559758 -1.583094 -2.020185
H  -0.671384 -2.613829 -0.563631
H  -2.483284 -0.185326 -1.174396
H  -2.616486 -1.213725 0.262796
H  -2.192501 0.606981 1.874508
H  -0.775736 1.648055 1.661097
H  -3.32033 1.695042 -0.093696
H  -1.853625 2.647212 -0.426334
H  -2.777764 2.906836 1.042085
H  2.743162 -1.70961 0.398081
H  2.980345 -0.311709 1.461028
H  2.041985 -2.229471 2.732423
H  0.886996 -0.921161 2.745488
H  0.654704 -2.338663 1.679598
H  2.967915 1.200284 -0.439415
H  2.739084 -0.161837 -1.548624
H  0.629845 0.920543 -2.445893
H  2.014298 1.97027 -2.602837
H  0.871875 2.29421 -1.324128
totalener: -462.82611166 hartree
nucrepener: 677.39366663 hartree
electener: -1140.21977829 hartree
oneelecener: -1938.11769647 hartree
twoeener: 797.89791818 hartree
kineticenergy: 459.17548471 hartree
exchangeener: -36.994195034817 hartree
correlationener: -3.679155605813 hartree
xcener: -40.673350640629 hartree
energy: -411.3878 -411.3795 -298.5120 -294.4125 -294.3875 -294.3749 -294.3700 -291.9760 -291.9690 -291.9422 -291.6464 -41.2414 -39.7277 -32.8575 -32.6903 -32.5575 -31.9833 -29.6818 -28.9509 -28.1730 -27.8631 -25.5052 -25.2794 -24.9778 -24.5545 -24.0222 -23.6165 -22.5466 -22.4518 -21.5094 -21.2036 -20.8831 -20.5988 -20.3259 -20.2260 -20.0608 -19.9364 -19.7141 -19.6699 -19.4469 -19.3406 -19.2781 -19.1553 -10.2653 -10.1918 -6.3918 -4.9239 -4.6444 -4.1321 -4.0112 -3.7945 -3.6290 -3.1987 -3.0855 -2.9236 -2.8307 -2.5641 -2.4656 -2.3782 -2.1119 -1.9791 -1.9329 -1.6847 -1.6137 -1.3860 -1.2393 -0.9867 -0.5874 -0.4863 -0.4443 -0.2282 -0.0141 0.1681 0.2800 3.0447 3.9244 4.0623 4.2647 4.6222 5.1028 5.4360 6.3443 6.5327 6.6050 6.8825 6.9519 7.2029 7.4386 7.9326 8.0369 8.8140 9.3224 9.4821 9.8028 9.9158 10.3917 10.5070 11.4242 12.0178 13.6220 14.5857 15.3998 16.4832 16.6255 16.7897 17.6475 17.7647 18.3280 18.7677 18.9904 19.1764 19.3312 19.7602 19.8181 20.1017 20.3876 20.4751 20.5643 20.7594 20.8408 21.0883 21.1520 21.4595 21.8509 22.2623 22.7873 23.0981 23.6234 23.9091 24.6973 25.4416 26.7545 28.0507 28.2436 28.3892 29.7073 31.1740 32.3160 32.6759 34.1249 34.3015 35.8667 36.3065 37.0292 37.9764 38.4498 39.1405 39.8372 40.6656 41.4187 41.8514 42.5539 43.7423 43.9415 44.0489 44.3980 44.9643 45.8353 46.0312 46.4138 46.5411 47.1325 48.4095 48.5807 49.2950 50.0022 51.2708 52.6127 53.3643 54.0684 55.1103 56.0206 56.2561 56.3886 56.8942 57.4643 57.6686 57.8398 58.2414 58.2900 58.6205 59.7617 60.2356 60.7596 61.5836 62.7592 63.2946 64.0445 64.1272 65.9362 71.4776 76.7791 77.1445 80.8948 361.6081 363.1516 364.2858 364.7823 370.6677 371.4308 371.7945 372.3168 374.5482 518.9747 521.2633 electronvolt
chargesum: 2.0000000
charge: -0.725636 -0.328014 -0.341509 -0.366963 -0.673569 0.758846 -0.363052 -0.321714 -0.727574 -0.322097 -0.726922 0.351625 0.256195 0.261593 0.337314 0.332701 0.338098 0.306284 0.279608 0.263510 0.332061 0.335094 0.334629 0.352336 0.261181 0.257347 0.335131 0.335259 0.256444 0.352248 0.259544
charge: -0.375044 -0.107956 0.067449 -0.103144 -0.363624 0.303361 0.059772 -0.105218 -0.375574 -0.105740 -0.375740 0.201576 0.151033 0.152388 0.184403 0.183220 0.182342 0.166645 0.161200 0.155176 0.194679 0.184080 0.184031 0.202134 0.153938 0.150647 0.184177 0.184279 0.151026 0.201946 0.152535
qa: -0.7256 -0.3280 -0.3415 -0.3670 -0.6736 0.7588 -0.3631 -0.3217 -0.7276 -0.3221 -0.7269 0.3516 0.2562 0.2616 0.3373 0.3327 0.3381 0.3063 0.2796 0.2635 0.3321 0.3351 0.3346 0.3523 0.2612 0.2573 0.3351 0.3353 0.2564 0.3522 0.2595
va: 3.6335 3.4566 3.3788 3.4549 3.6171 3.5732 3.3794 3.4485 3.6353 3.4500 3.6374 0.8583 0.8973 0.8955 0.8503 0.8551 0.8514 0.8720 0.8899 0.8963 0.8653 0.8521 0.8531 0.8579 0.8943 0.8972 0.8528 0.8520 0.8971 0.8578 0.8954
dispersion: -0.017531259 hartree
energy: -462.795157297379 hartree
dipole: -1.67611 2.01082 0.33470 0.14842 -0.15794 -0.00952 -1.22302 1.42824 0.20522
magnitude: 0.39273 au
magnitude: 0.99823 debye
temp: 298.15 k
press: 1.00 atm
zeropoint: 0.29203559 hartree
thermalvibcorrection: 0.01168264 hartree
thermalrotcorrection: 0.00141627 hartree
thermaltrasncorrection: 0.00141627 hartree
thermaltotal: -462.48860653 hartree
thermalcorr: 0.01451518 hartree
nonthermalcorr: 0.29203559 hartree
totalcorr: 0.30655077 hartree
thermalcorrenthalpy: 0.00094421 hartree
totalenthalpy: -462.48766232 hartree
vibrat: 0.02080308 hartree
rotat: 0.01460251 hartree
transl: 0.01950351 hartree
total: 0.05490911 hartree
totalentropycorr: -0.05490911 hartree
gibbsenthalpy: -462.54257143 hartree
gibbsminuselec: 0.25258587 hartree
