program: Orca
programVersion: 5.0.4
elementType: C C N C C C N C C C C H H H H H H H H H H H H H H H H H H H H
charge: 2
multiplicity: 1
keywords: SP DSD-BLYP D3BJ def2-QZVPP def2-QZVPP/C def2/J TightSCF
formula: C9H20N2
InChI: InChI=1/C9H20N2/c1-5-10(6-2)9-11(7-3)8-4/h5-8H2,1-4H3
31 atoms
C  -1.273317 -1.943094 -1.271217
C  -1.987003 -0.836254 -0.540437
N  -1.051842 0.086807 0.211931
C  -1.657621 1.167669 1.10464
C  -2.486137 2.146797 0.305958
C  0.168287 -0.022164 0.11395
N  1.392988 -0.113334 0.036561
C  2.180997 -0.982811 0.999258
C  1.328332 -1.636481 2.05394
C  2.170941 0.629308 -1.033442
C  1.307778 1.494676 -1.912915
H  -2.02888 -2.554207 -1.76485
H  -0.614444 -1.578275 -2.060089
H  -0.72607 -2.60901 -0.603536
H  -2.53797 -0.180508 -1.214301
H  -2.671173 -1.208907 0.222891
H  -2.247187 0.6118 1.834603
H  -0.830422 1.652874 1.621192
H  -3.375016 1.699861 -0.133601
H  -1.908311 2.652031 -0.466239
H  -2.83245 2.911654 1.00218
H  2.688476 -1.704791 0.358176
H  2.925659 -0.30689 1.421123
H  1.987299 -2.224652 2.692518
H  0.83231 -0.916343 2.705583
H  0.600018 -2.333844 1.639693
H  2.913229 1.205103 -0.47932
H  2.684397 -0.157019 -1.588529
H  0.575158 0.925361 -2.485798
H  1.959612 1.975089 -2.642742
H  0.817189 2.299029 -1.364033
totalener: -462.41755390 hartree
nucrepener: 677.39366636 hartree
electener: -1139.81122026 hartree
oneelecener: -1938.42729454 hartree
twoeener: 798.61607429 hartree
kineticenergy: 461.15212548 hartree
exchangeener: -20.645251153934 hartree
correlationener: -1.519087854029 hartree
xcener: -22.164339007963 hartree
chargesum: 2.0000000
charge: -0.171653 0.056094 -0.123003 0.063103 -0.155623 0.436416 -0.174282 0.062027 -0.164791 0.055076 -0.170348 0.138763 0.071799 0.080380 0.146405 0.140978 0.138550 0.109129 0.093514 0.080853 0.129222 0.141357 0.142018 0.138302 0.077907 0.076157 0.146218 0.144080 0.072641 0.140407 0.078303
charge: 0.275174 0.129530 0.500563 0.137144 0.284465 -0.054234 0.500003 0.134589 0.275212 0.133882 0.273971 -0.017059 -0.048184 -0.047760 -0.018230 -0.014609 -0.017956 -0.026384 -0.045098 -0.047674 -0.020852 -0.015729 -0.015944 -0.016708 -0.045845 -0.049050 -0.015792 -0.015490 -0.048118 -0.016510 -0.047308
qa: -0.1717 0.0561 -0.1230 0.0631 -0.1556 0.4364 -0.1743 0.0620 -0.1648 0.0551 -0.1703 0.1388 0.0718 0.0804 0.1464 0.1410 0.1385 0.1091 0.0935 0.0809 0.1292 0.1414 0.1420 0.1383 0.0779 0.0762 0.1462 0.1441 0.0726 0.1404 0.0783
va: 3.8912 3.6798 3.3108 3.7052 3.8871 3.6602 3.3422 3.6836 3.8915 3.6855 3.8927 0.9980 1.0001 1.0026 0.9719 0.9726 0.9764 0.9759 0.9963 1.0030 0.9977 0.9718 0.9738 0.9980 0.9982 1.0011 0.9730 0.9711 1.0001 0.9980 0.9993
total: -463.430611264 hartree
dispersion: -0.016943846 hartree
energy: -463.447555110296 hartree
dipole: -1.67611 1.99733 0.32122 0.14842 -0.16169 -0.01328 -1.22302 1.41857 0.19555
magnitude: 0.37630 au
magnitude: 0.95647 debye
