program: Orca
programVersion: 5.0.4
elementType: N C F N C C C C C C H H H H H H H H
charge: 1
multiplicity: 1
keywords: Freq RIJCOSX PBEh-3c
frequency: 0.00 0.00 0.00 0.00 0.00 0.00 36.22 101.07 105.32 274.82 382.09 411.58 428.11 493.57 525.52 562.79 578.41 642.12 665.73 670.94 729.84 768.57 799.50 893.78 903.91 989.46 1042.70 1046.23 1056.08 1073.34 1083.55 1138.85 1143.04 1227.01 1236.09 1289.06 1381.04 1404.59 1421.95 1540.83 1582.10 1627.90 1711.05 1711.81 1735.14 1832.51 3276.63 3277.92 3290.51 3299.80 3306.85 3617.59 3631.62 3742.94
frequency: 36.22 101.07 105.32 274.82 382.09 411.58 428.11 493.57 525.52 562.79 578.41 642.12 665.73 670.94 729.84 768.57 799.50 893.78 903.91 989.46 1042.70 1046.23 1056.08 1073.34 1083.55 1138.85 1143.04 1227.01 1236.09 1289.06 1381.04 1404.59 1421.95 1540.83 1582.10 1627.90 1711.05 1711.81 1735.14 1832.51 3276.63 3277.92 3290.51 3299.80 3306.85 3617.59 3631.62 3742.94
formula: C7H8FN2
InChI: InChI=1/C7H8FN2/c8-7(9)10-6-4-2-1-3-5-6/h1-5,10H,9H2
18 atoms
N  2.44375 -0.110869 0.93781
C  2.391053 -0.284482 -0.353922
F  3.512949 -0.499861 -0.963401
N  1.315746 -0.262555 -1.087013
C  0.005646 -0.063095 -0.531142
C  -0.72914 -1.171429 -0.135594
C  -1.999605 -0.978614 0.383835
C  -2.516606 0.3044 0.497568
C  -1.76947 1.403013 0.095894
C  -0.496961 1.225733 -0.425063
H  3.327232 -0.145165 1.425674
H  1.604209 0.066747 1.47204
H  1.424502 -0.405895 -2.085064
H  -0.322738 -2.169137 -0.243199
H  -2.587234 -1.832115 0.691599
H  -3.511038 0.448704 0.896822
H  -2.179571 2.399687 0.179562
H  0.087276 2.074931 -0.756405
totalener: -479.67098022 hartree
nucrepener: 505.62790749 hartree
electener: -985.29888770 hartree
oneelecener: -1642.01617751 hartree
twoeener: 656.71728980 hartree
kineticenergy: 476.25132676 hartree
exchangeener: -34.736579267995 hartree
correlationener: -3.186409176602 hartree
xcener: -37.922988444597 hartree
energy: -689.9593 -405.3728 -405.1941 -295.3630 -290.0744 -288.7265 -288.7203 -288.3530 -288.3487 -288.3035 -44.0669 -35.7959 -33.7203 -30.3687 -27.5659 -27.1430 -25.7240 -24.2721 -24.0167 -23.0654 -22.4259 -21.7517 -21.3319 -20.8907 -19.7147 -19.0716 -18.8193 -17.6696 -17.4567 -17.2255 -15.9033 -15.3753 -15.3545 -14.4924 -12.4060 -12.2265 -4.2719 -4.0036 -3.6399 -1.5565 -1.3518 -0.4578 0.1025 0.9940 1.4354 1.6573 2.0244 2.3750 2.7419 3.3767 3.6417 4.6262 5.0364 5.7960 5.9489 7.2199 7.3357 8.8651 9.4989 9.9658 10.3694 10.4678 11.5607 11.7631 11.8586 12.3345 12.7432 12.7857 13.2114 13.5151 13.5513 13.8442 14.2145 15.0493 16.2999 16.6405 16.7593 18.1935 19.9774 20.4507 21.2446 21.5866 21.7104 21.8819 22.0570 22.5149 22.7316 22.7608 23.4620 24.5368 24.6144 25.1174 25.8125 25.9268 26.1274 27.0202 27.4482 28.0324 29.0849 29.2586 29.8662 30.3191 31.1155 31.6610 31.9063 34.0218 34.2627 36.1500 37.2942 37.7668 38.3769 38.5132 39.0649 39.6164 40.1115 41.3661 43.4176 44.8432 44.8663 46.3283 47.0502 47.9152 48.6736 50.6230 51.3567 51.8161 53.5774 54.4218 54.9541 55.6616 55.9259 56.1984 56.9817 57.8918 58.5328 59.6737 60.1049 60.5494 61.6758 63.5499 64.8961 66.1928 67.0067 67.2212 68.3030 70.5211 70.9307 71.3077 72.7422 73.3329 74.3738 74.7580 79.1515 81.2295 81.6694 90.7023 355.9862 367.6664 368.0071 375.3853 380.5359 381.2387 392.5504 517.7055 522.8668 887.2035 electronvolt
chargesum: 1.0000000
charge: -0.764976 0.873326 -0.209380 -0.675624 0.176455 -0.219888 -0.224644 -0.197295 -0.224667 -0.222806 0.446897 0.451771 0.436032 0.265512 0.274046 0.275131 0.273932 0.266178
charge: -0.268580 0.306003 -0.044944 -0.125606 -0.046613 -0.125278 -0.105893 -0.091632 -0.106157 -0.126204 0.310461 0.309281 0.312640 0.158039 0.161912 0.162415 0.161869 0.158287
qa: -0.7650 0.8733 -0.2094 -0.6756 0.1765 -0.2199 -0.2246 -0.1973 -0.2247 -0.2228 0.4469 0.4518 0.4360 0.2655 0.2740 0.2751 0.2739 0.2662
va: 3.0332 3.8879 1.2280 3.0899 3.5643 3.7730 3.8028 3.7696 3.8025 3.7735 0.7895 0.7871 0.7937 0.8943 0.8915 0.8904 0.8916 0.8939
dispersion: -0.010384456 hartree
energy: -479.649913367902 hartree
dipole: -7.90004 9.23219 1.33215 1.30057 -1.34406 -0.04348 3.53179 -2.96493 0.56686
magnitude: 1.44839 au
magnitude: 3.68153 debye
temp: 298.15 k
press: 1.00 atm
zeropoint: 0.14965754 hartree
thermalvibcorrection: 0.00554537 hartree
thermalrotcorrection: 0.00141627 hartree
thermaltrasncorrection: 0.00141627 hartree
thermaltotal: -479.49187792 hartree
thermalcorr: 0.00837791 hartree
nonthermalcorr: 0.14965754 hartree
totalcorr: 0.15803545 hartree
thermalcorrenthalpy: 0.00094421 hartree
totalenthalpy: -479.49093371 hartree
vibrat: 0.00933948 hartree
rotat: 0.01402224 hartree
transl: 0.01933918 hartree
total: 0.04270090 hartree
totalentropycorr: -0.04270090 hartree
gibbsenthalpy: -479.53363461 hartree
gibbsminuselec: 0.11627876 hartree
