program: Orca
programVersion: 5.0.4
elementType: N C F N C C C C C C H H H H H H H H
charge: 1
multiplicity: 1
keywords: Opt RIJCOSX PBEh-3c
formula: C7H8FN2
InChI: InChI=1/C7H8FN2/c8-7(9)10-6-4-2-1-3-5-6/h1-5,10H,9H2
18 atoms
N  2.44375 -0.110869 0.93781
C  2.391053 -0.284482 -0.353922
F  3.512949 -0.499861 -0.963401
N  1.315746 -0.262555 -1.087013
C  0.005646 -0.063095 -0.531142
C  -0.72914 -1.171429 -0.135594
C  -1.999605 -0.978614 0.383835
C  -2.516606 0.3044 0.497568
C  -1.76947 1.403013 0.095894
C  -0.496961 1.225733 -0.425062
H  3.327232 -0.145165 1.425675
H  1.604209 0.066747 1.47204
H  1.424502 -0.405895 -2.085064
H  -0.322738 -2.169137 -0.243199
H  -2.587234 -1.832115 0.691599
H  -3.511038 0.448704 0.896822
H  -2.179571 2.399687 0.179562
H  0.087276 2.074931 -0.756405
totalener: -479.67098289 hartree
nucrepener: 505.63855867 hartree
electener: -985.30954156 hartree
oneelecener: -1642.03640175 hartree
twoeener: 656.72686019 hartree
kineticenergy: 476.25120004 hartree
exchangeener: -34.736581483360 hartree
correlationener: -3.186416076220 hartree
xcener: -37.922997559581 hartree
dispersion: -0.010384678 hartree
energy: -689.9566 -405.3795 -405.2006 -295.3561 -290.0719 -288.7254 -288.7185 -288.3537 -288.3496 -288.3073 -44.0647 -35.7964 -33.7214 -30.3686 -27.5664 -27.1428 -25.7243 -24.2722 -24.0171 -23.0655 -22.4259 -21.7503 -21.3332 -20.8908 -19.7139 -19.0718 -18.8196 -17.6699 -17.4565 -17.2255 -15.9034 -15.3760 -15.3555 -14.4935 -12.4066 -12.2266 -4.2713 -4.0039 -3.6400 -1.5569 -1.3516 -0.4581 0.1021 0.9938 1.4356 1.6575 2.0242 2.3749 2.7416 3.3766 3.6414 4.6261 5.0363 5.7959 5.9487 7.2202 7.3362 8.8658 9.5004 9.9662 10.3696 10.4683 11.5607 11.7631 11.8582 12.3346 12.7431 12.7855 13.2112 13.5144 13.5513 13.8440 14.2139 15.0492 16.2997 16.6391 16.7592 18.1936 19.9763 20.4503 21.2437 21.5860 21.7107 21.8815 22.0562 22.5147 22.7312 22.7606 23.4613 24.5366 24.6142 25.1170 25.8122 25.9268 26.1284 27.0205 27.4480 28.0329 29.0858 29.2590 29.8668 30.3186 31.1155 31.6610 31.9063 34.0222 34.2628 36.1495 37.2941 37.7660 38.3767 38.5127 39.0655 39.6160 40.1099 41.3655 43.4183 44.8432 44.8661 46.3279 47.0501 47.9146 48.6746 50.6220 51.3574 51.8162 53.5772 54.4218 54.9536 55.6615 55.9259 56.1981 56.9816 57.8920 58.5318 59.6741 60.1047 60.5493 61.6765 63.5495 64.8965 66.1926 67.0064 67.2213 68.3025 70.5209 70.9307 71.3075 72.7418 73.3330 74.3731 74.7599 79.1518 81.2296 81.6695 90.7021 355.9860 367.6666 368.0066 375.3910 380.5363 381.2384 392.5504 517.7001 522.8612 887.2060 electronvolt
chargesum: 1.0000000
charge: -0.764460 0.872769 -0.209359 -0.675092 0.176072 -0.219772 -0.224475 -0.197177 -0.224387 -0.222771 0.446777 0.451654 0.435939 0.265451 0.273938 0.274952 0.273901 0.266041
charge: -0.268266 0.305624 -0.044932 -0.125266 -0.046706 -0.125308 -0.105828 -0.091477 -0.106077 -0.126248 0.310389 0.309204 0.312578 0.158003 0.161876 0.162353 0.161843 0.158240
qa: -0.7645 0.8728 -0.2094 -0.6751 0.1761 -0.2198 -0.2245 -0.1972 -0.2244 -0.2228 0.4468 0.4517 0.4359 0.2655 0.2739 0.2750 0.2739 0.2660
va: 3.0336 3.8881 1.2281 3.0903 3.5645 3.7729 3.8029 3.7697 3.8025 3.7736 0.7896 0.7872 0.7938 0.8943 0.8915 0.8905 0.8916 0.8940
dispersion: -0.010384456 hartree
energy: -479.649913598854 hartree
dipole: -7.90004 9.23145 1.33141 1.30057 -1.34393 -0.04335 3.53179 -2.96469 0.56710
magnitude: 1.44780 au
magnitude: 3.68003 debye
