program: Orca
programVersion: 5.0.4
elementType: N C F N C C C C C C H H H H H H H H
charge: 1
multiplicity: 1
keywords: SP DSD-BLYP D3BJ def2-QZVPP def2-QZVPP/C def2/J TightSCF
formula: C7H8FN2
InChI: InChI=1/C7H8FN2/c8-7(9)10-6-4-2-1-3-5-6/h1-5,10H,9H2
18 atoms
N  2.042828 -0.045797 1.113343
C  1.990132 -0.21941 -0.17839
F  3.112027 -0.434789 -0.787868
N  0.914824 -0.197483 -0.91148
C  -0.395275 0.001978 -0.35561
C  -1.130062 -1.106357 0.039939
C  -2.400526 -0.913542 0.559368
C  -2.917528 0.369472 0.673101
C  -2.170391 1.468085 0.271427
C  -0.897883 1.290805 -0.24953
H  2.92631 -0.080092 1.601207
H  1.203287 0.131819 1.647573
H  1.02358 -0.340823 -1.909531
H  -0.72366 -2.104065 -0.067666
H  -2.988156 -1.767043 0.867132
H  -3.911959 0.513777 1.072355
H  -2.580493 2.464759 0.355095
H  -0.313646 2.140003 -0.580872
totalener: -479.45253777 hartree
nucrepener: 505.62790735 hartree
electener: -985.08044512 hartree
oneelecener: -1642.20695748 hartree
twoeener: 657.12651236 hartree
kineticenergy: 478.22847567 hartree
exchangeener: -19.361766371681 hartree
correlationener: -1.341655018836 hartree
xcener: -20.703421390517 hartree
chargesum: 1.0000000
charge: -0.286614 0.512891 -0.146590 -0.241602 0.172728 -0.108690 -0.070050 -0.099598 -0.066208 -0.114082 0.265790 0.268760 0.264959 0.128543 0.130261 0.129791 0.130362 0.129350
charge: 0.767535 -0.635227 0.514985 0.617001 -0.210998 0.086864 0.102060 0.110741 0.101835 0.086566 -0.110415 -0.112708 -0.100855 -0.044639 -0.043409 -0.041079 -0.043483 -0.044773
qa: -0.2866 0.5129 -0.1466 -0.2416 0.1727 -0.1087 -0.0701 -0.0996 -0.0662 -0.1141 0.2658 0.2688 0.2650 0.1285 0.1303 0.1298 0.1304 0.1294
va: 3.3466 4.1654 1.1767 3.2490 3.4832 3.7966 3.8101 3.8580 3.8116 3.7974 0.9659 0.9779 0.9620 0.9772 0.9791 0.9808 0.9785 0.9779
total: -480.362904374 hartree
dispersion: -0.011941300 hartree
energy: -480.374845674345 hartree
dipole: -7.90004 9.14001 1.23997 1.30057 -1.33939 -0.03881 3.53179 -3.00813 0.52366
magnitude: 1.34657 au
magnitude: 3.42271 debye
