program: Orca
programVersion: 5.0.4
elementType: N C F F N C C C C C C H H H H H H H H
charge: 0
multiplicity: 1
keywords: SP DSD-BLYP D3BJ def2-QZVPP def2-QZVPP/C def2/J TightSCF
formula: C7H8F2N2
InChI: InChI=1/C7H8F2N2/c8-7(9,10)11-6-4-2-1-3-5-6/h1-5,11H,10H2
19 atoms
N  2.130277 -0.713778 0.971586
C  1.823336 0.046436 -0.159315
F  2.819965 0.91685 -0.533432
F  1.718188 -0.808142 -1.215725
N  0.682393 0.850126 0.026677
C  -0.62176 0.35562 0.133771
C  -0.931479 -0.931176 0.571215
C  -2.257368 -1.323601 0.672551
C  -3.29315 -0.460955 0.35112
C  -2.984241 0.820052 -0.079615
C  -1.665867 1.223483 -0.189178
H  2.949683 -1.293134 0.85998
H  2.181218 -0.158146 1.811263
H  0.741724 1.714402 -0.488654
H  -0.147971 -1.622478 0.842456
H  -2.478126 -2.327667 1.011057
H  -4.322837 -0.780142 0.434502
H  -3.772406 1.514658 -0.338945
H  -1.4426 2.227816 -0.531944
totalener: -579.37405542 hartree
nucrepener: 621.55076678 hartree
electener: -1200.92482220 hartree
oneelecener: -2027.15149344 hartree
twoeener: 826.22667125 hartree
kineticenergy: 578.02594321 hartree
exchangeener: -22.585951828088 hartree
correlationener: -1.547436991176 hartree
xcener: -24.133388819264 hartree
chargesum: -0.0000000
charge: -0.423882 0.727704 -0.308613 -0.305002 -0.387633 0.180629 -0.054674 -0.107159 -0.129391 -0.091173 -0.098420 0.184842 0.194342 0.184033 0.101359 0.094192 0.089174 0.086956 0.062713
charge: 0.636255 -1.098865 0.314075 0.341585 0.536273 -0.213090 0.073901 0.062979 0.049678 0.059779 0.064585 -0.179028 -0.174501 -0.162805 -0.067674 -0.057689 -0.065308 -0.058136 -0.062015
qa: -0.4239 0.7277 -0.3086 -0.3050 -0.3876 0.1806 -0.0547 -0.1072 -0.1294 -0.0912 -0.0984 0.1848 0.1943 0.1840 0.1014 0.0942 0.0892 0.0870 0.0627
va: 2.9805 4.1881 0.9538 0.9801 2.9987 3.7012 3.6853 3.8070 3.8384 3.8407 3.7387 1.0246 1.0099 1.0222 1.0015 0.9848 0.9892 0.9870 1.0002
total: -580.434115606 hartree
dispersion: -0.012334775 hartree
energy: -580.446450381214 hartree
dipole: -10.09147 10.20280 0.11133 -0.77985 0.95418 0.17432 5.00326 -4.38696 0.61630
magnitude: 0.65008 au
magnitude: 1.65238 debye
