program: Orca
programVersion: 5.0.4
elementType: N C N C C C C C C O H H H H H H H H
charge: 0
multiplicity: 1
keywords: Freq RIJCOSX PBEh-3c
frequency: 0.00 0.00 0.00 0.00 0.00 0.00 35.20 78.26 178.94 247.80 347.35 358.76 385.81 428.24 518.34 541.68 548.21 599.72 645.52 724.15 728.67 796.41 805.89 873.27 889.14 949.40 1013.89 1039.47 1041.48 1053.31 1096.09 1142.47 1156.83 1215.83 1246.24 1321.88 1367.37 1405.72 1409.18 1530.48 1592.68 1642.46 1705.91 1716.01 1732.96 1905.28 3238.12 3268.00 3276.16 3291.79 3341.21 3674.10 3697.61 3788.53
frequency: 35.20 78.26 178.94 247.80 347.35 358.76 385.81 428.24 518.34 541.68 548.21 599.72 645.52 724.15 728.67 796.41 805.89 873.27 889.14 949.40 1013.89 1039.47 1041.48 1053.31 1096.09 1142.47 1156.83 1215.83 1246.24 1321.88 1367.37 1405.72 1409.18 1530.48 1592.68 1642.46 1705.91 1716.01 1732.96 1905.28 3238.12 3268.00 3276.16 3291.79 3341.21 3674.10 3697.61 3788.53
formula: C7H8N2O
InChI: InChI=1/C7H8N2O/c8-7(10)9-6-4-2-1-3-5-6/h1-5,9H,8H2
18 atoms
N  3.547165 0.100681 -0.142141
C  2.319753 -0.475088 0.102219
N  1.277956 0.394634 -0.121337
C  -0.093871 0.15992 -0.007213
C  -0.937571 1.257647 -0.18963
C  -2.311418 1.118358 -0.114867
C  -2.875653 -0.121365 0.14309
C  -2.0388 -1.210599 0.325748
C  -0.659126 -1.087896 0.255738
O  2.200083 -1.609594 0.501687
H  4.316694 -0.545617 -0.113794
H  3.632976 0.811705 -0.847817
H  1.522416 1.357315 -0.282065
H  -0.515294 2.235859 -0.393577
H  -2.940751 1.986562 -0.260027
H  -3.949373 -0.23565 0.202077
H  -2.461108 -2.185721 0.530774
H  -0.034179 -1.951351 0.411235
totalener: -455.34606119 hartree
nucrepener: 490.57003652 hartree
electener: -945.91609772 hartree
oneelecener: -1590.38383298 hartree
twoeener: 644.46773527 hartree
kineticenergy: 452.00816042 hartree
exchangeener: -33.873940746304 hartree
correlationener: -3.170273351663 hartree
xcener: -37.044214097967 hartree
energy: -529.4889 -399.4144 -398.8123 -287.9206 -285.6373 -284.2918 -284.2751 -284.1697 -284.0191 -283.9728 -31.7837 -28.7012 -27.3450 -25.6953 -22.8021 -22.6677 -19.7168 -18.8972 -17.8142 -16.9377 -16.6413 -15.6112 -14.7173 -13.8756 -13.8279 -13.4245 -13.2770 -12.8881 -11.8256 -11.3321 -10.8442 -9.9454 -9.1913 -8.7343 -7.9484 -6.9833 0.6025 0.6641 2.6903 2.9252 3.8200 4.4315 4.9292 5.6731 5.8043 5.9033 6.7250 6.9860 7.6073 7.8623 8.9833 9.4689 9.7698 10.4644 11.1477 12.2948 12.9416 13.7664 14.3470 14.6477 15.6714 15.9143 16.0021 16.5724 16.6732 16.9490 17.0835 17.2917 17.5096 17.9541 18.4563 18.9096 19.9560 20.2018 20.4266 20.8834 22.7366 22.9766 24.4006 24.8709 24.8938 25.7329 25.9113 26.6100 26.8460 27.4574 27.7728 27.9515 28.7869 29.1729 29.3231 29.7848 30.2879 30.7773 31.4634 31.5373 32.6397 34.5570 35.3511 35.6777 36.1590 36.9859 37.9894 38.3364 40.1465 40.8609 41.8490 42.1494 42.7621 42.8000 43.2589 43.8948 47.0552 47.2548 49.1987 49.8785 51.0104 51.3957 51.7904 52.4437 53.4545 54.9407 56.0268 56.6004 56.6650 57.7719 58.2333 59.2127 59.8664 60.1189 60.7078 61.8898 62.6180 63.9518 64.6628 65.0263 66.0728 66.5843 67.5574 69.2001 70.4218 70.9866 71.8237 73.1679 74.5763 75.3668 76.0214 76.2257 76.5163 78.7204 79.1117 81.3398 83.6557 85.6464 92.7013 95.6049 360.1623 372.0932 372.3604 379.1885 385.3012 385.7249 396.6175 522.1349 528.8042 700.9226 electronvolt
chargesum: -0.0000000
charge: -0.830075 0.674812 -0.767356 0.406526 -0.324897 -0.208154 -0.239256 -0.209677 -0.292247 -0.432317 0.374179 0.347245 0.355205 0.205632 0.217591 0.216383 0.221238 0.285169
charge: -0.405496 0.127579 -0.216833 0.038088 -0.170910 -0.125793 -0.158440 -0.120672 -0.158057 -0.273423 0.261256 0.245272 0.258163 0.128349 0.135993 0.134897 0.137209 0.162819
qa: -0.8301 0.6748 -0.7674 0.4065 -0.3249 -0.2082 -0.2393 -0.2097 -0.2922 -0.4323 0.3742 0.3472 0.3552 0.2056 0.2176 0.2164 0.2212 0.2852
va: 2.8416 4.1358 2.9791 3.6440 3.8160 3.8675 3.8162 3.8148 3.7744 2.1917 0.8444 0.8566 0.8530 0.9153 0.9116 0.9130 0.9110 0.8999
dispersion: -0.010268060 hartree
energy: -455.324182272997 hartree
dipole: -1.62186 2.18457 0.56271 2.55802 -1.30029 1.25773 -1.24071 0.44715 -0.79357
magnitude: 1.59006 au
magnitude: 4.04160 debye
temp: 298.15 k
press: 1.00 atm
zeropoint: 0.14942915 hartree
thermalvibcorrection: 0.00573936 hartree
thermalrotcorrection: 0.00141627 hartree
thermaltrasncorrection: 0.00141627 hartree
thermaltotal: -455.16618122 hartree
thermalcorr: 0.00857190 hartree
nonthermalcorr: 0.14942915 hartree
totalcorr: 0.15800105 hartree
thermalcorrenthalpy: 0.00094421 hartree
totalenthalpy: -455.16523701 hartree
vibrat: 0.00957105 hartree
rotat: 0.01400301 hartree
transl: 0.01930833 hartree
total: 0.04288239 hartree
totalentropycorr: -0.04288239 hartree
gibbsenthalpy: -455.20811940 hartree
gibbsminuselec: 0.11606287 hartree
