program: Orca
programVersion: 5.0.4
elementType: N C N C C C C C C O H H H H H H H H
charge: 0
multiplicity: 1
keywords: Opt RIJCOSX PBEh-3c
formula: C7H8N2O
InChI: InChI=1/C7H8N2O/c8-7(10)9-6-4-2-1-3-5-6/h1-5,9H,8H2
18 atoms
N  3.547165 0.10068 -0.142141
C  2.319753 -0.475088 0.102219
N  1.277956 0.394634 -0.121337
C  -0.093871 0.15992 -0.007213
C  -0.937571 1.257647 -0.18963
C  -2.311418 1.118358 -0.114867
C  -2.875653 -0.121365 0.14309
C  -2.0388 -1.210599 0.325748
C  -0.659126 -1.087896 0.255738
O  2.200083 -1.609594 0.501687
H  4.316694 -0.545617 -0.113794
H  3.632976 0.811705 -0.847817
H  1.522416 1.357315 -0.282065
H  -0.515294 2.235859 -0.393577
H  -2.940751 1.986562 -0.260027
H  -3.949373 -0.23565 0.202077
H  -2.461108 -2.185721 0.530774
H  -0.034179 -1.951351 0.411235
totalener: -455.34605584 hartree
nucrepener: 490.55532049 hartree
electener: -945.90137633 hartree
oneelecener: -1590.35411779 hartree
twoeener: 644.45274146 hartree
kineticenergy: 452.00667758 hartree
exchangeener: -33.873780303995 hartree
correlationener: -3.170256422471 hartree
xcener: -37.044036726466 hartree
dispersion: -0.010267772 hartree
energy: -529.4897 -399.4155 -398.8154 -287.9190 -285.6357 -284.2912 -284.2746 -284.1708 -284.0192 -283.9727 -31.7837 -28.7011 -27.3455 -25.6952 -22.8020 -22.6675 -19.7168 -18.8971 -17.8143 -16.9380 -16.6414 -15.6114 -14.7175 -13.8756 -13.8278 -13.4244 -13.2770 -12.8880 -11.8255 -11.3322 -10.8441 -9.9456 -9.1917 -8.7347 -7.9483 -6.9832 0.6025 0.6643 2.6902 2.9253 3.8200 4.4314 4.9289 5.6732 5.8044 5.9033 6.7250 6.9860 7.6073 7.8624 8.9833 9.4690 9.7699 10.4645 11.1478 12.2948 12.9418 13.7667 14.3472 14.6478 15.6715 15.9146 16.0021 16.5725 16.6734 16.9492 17.0837 17.2918 17.5095 17.9541 18.4563 18.9096 19.9560 20.2017 20.4268 20.8833 22.7365 22.9760 24.4005 24.8710 24.8938 25.7330 25.9112 26.6100 26.8458 27.4566 27.7726 27.9514 28.7869 29.1727 29.3231 29.7847 30.2880 30.7771 31.4634 31.5372 32.6399 34.5570 35.3513 35.6777 36.1592 36.9860 37.9893 38.3364 40.1465 40.8609 41.8492 42.1494 42.7621 42.7999 43.2591 43.8943 47.0552 47.2547 49.1984 49.8787 51.0104 51.3958 51.7905 52.4436 53.4546 54.9407 56.0267 56.6004 56.6650 57.7718 58.2335 59.2128 59.8665 60.1190 60.7079 61.8897 62.6178 63.9516 64.6629 65.0264 66.0730 66.5843 67.5576 69.2002 70.4218 70.9865 71.8238 73.1679 74.5764 75.3669 76.0215 76.2259 76.5164 78.7205 79.1119 81.3399 83.6558 85.6464 92.7016 95.6051 360.1625 372.0932 372.3609 379.1898 385.3014 385.7253 396.6178 522.1325 528.8031 700.9219 electronvolt
chargesum: 0.0000000
charge: -0.829926 0.674666 -0.767273 0.406416 -0.324924 -0.208129 -0.239258 -0.209595 -0.292225 -0.432270 0.374144 0.347204 0.355186 0.205638 0.217584 0.216379 0.221218 0.285166
charge: -0.405386 0.127475 -0.216778 0.038014 -0.170940 -0.125778 -0.158432 -0.120619 -0.158049 -0.273390 0.261231 0.245244 0.258150 0.128355 0.135990 0.134893 0.137202 0.162818
qa: -0.8299 0.6747 -0.7673 0.4064 -0.3249 -0.2081 -0.2393 -0.2096 -0.2922 -0.4323 0.3741 0.3472 0.3552 0.2056 0.2176 0.2164 0.2212 0.2852
va: 2.8417 4.1359 2.9792 3.6440 3.8160 3.8675 3.8162 3.8148 3.7744 2.1917 0.8444 0.8566 0.8531 0.9153 0.9116 0.9130 0.9110 0.8999
dispersion: -0.010268060 hartree
energy: -455.324182280274 hartree
dipole: -1.62186 2.18446 0.56261 2.55802 -1.30048 1.25754 -1.24071 0.44717 -0.79354
magnitude: 1.58985 au
magnitude: 4.04109 debye
