program: Orca
programVersion: 5.0.4
elementType: N C N C C C C C C H H H H H H H H
charge: 2
multiplicity: 1
keywords: Freq RIJCOSX PBEh-3c
frequency: 0.00 0.00 0.00 0.00 0.00 0.00 72.50 116.84 164.86 235.18 342.89 391.55 421.98 460.15 592.03 615.30 654.12 711.11 802.13 827.25 857.98 898.52 952.40 999.52 1031.98 1047.21 1055.31 1067.19 1121.34 1148.54 1181.01 1241.36 1247.83 1302.67 1389.88 1449.48 1509.52 1545.85 1574.09 1637.92 1667.23 1693.53 2113.12 3258.71 3263.73 3291.50 3305.19 3308.68 3367.17 3386.93 3481.32
frequency: 72.50 116.84 164.86 235.18 342.89 391.55 421.98 460.15 592.03 615.30 654.12 711.11 802.13 827.25 857.98 898.52 952.40 999.52 1031.98 1047.21 1055.31 1067.19 1121.34 1148.54 1181.01 1241.36 1247.83 1302.67 1389.88 1449.48 1509.52 1545.85 1574.09 1637.92 1667.23 1693.53 2113.12 3258.71 3263.73 3291.50 3305.19 3308.68 3367.17 3386.93 3481.32
formula: C7H8N2
InChI: InChI=1/C7H8N2/c8-6-9-7-4-2-1-3-5-7/h1-5,9H,8H2
17 atoms
N  3.475208 -0.230847 0.021936
C  2.338327 -0.710456 0.179634
N  1.167403 -0.990494 -0.241322
C  -0.034765 -0.332942 -0.101213
C  -1.18446 -1.021692 -0.55103
C  -2.398054 -0.384393 -0.481097
C  -2.469361 0.907288 0.046834
C  -1.321239 1.576973 0.509481
C  -0.098834 0.965269 0.448268
H  3.774132 0.247197 -0.84248
H  4.185999 -0.30396 0.761248
H  1.107163 -1.942274 -0.640893
H  -1.121396 -2.026814 -0.95483
H  -3.29289 -0.883054 -0.827002
H  -3.430117 1.402699 0.112278
H  -1.408644 2.571601 0.924618
H  0.779227 1.476469 0.826563
totalener: -379.44101835 hartree
nucrepener: 399.77636192 hartree
electener: -779.21738027 hartree
oneelecener: -1280.56890357 hartree
twoeener: 501.35152330 hartree
kineticenergy: 376.64849653 hartree
exchangeener: -28.873306060516 hartree
correlationener: -2.698780717886 hartree
xcener: -31.572086778402 hartree
energy: -412.9104 -412.1475 -299.3221 -295.7726 -293.9736 -293.8714 -293.5801 -293.1373 -293.0019 -42.2657 -40.4746 -35.5188 -33.1290 -32.2430 -30.8587 -29.6390 -29.2111 -28.3708 -27.1997 -26.3165 -24.3411 -24.1592 -23.4007 -23.1447 -22.2862 -22.2561 -20.3123 -20.1763 -19.8153 -17.0965 -17.0591 -12.8369 -11.5868 -8.2816 -8.1563 -6.9868 -6.1878 -5.1025 -4.3570 -3.6680 -3.2671 -2.4045 -2.1679 -1.7339 -1.4097 -0.5463 0.1792 0.5741 0.8799 1.5746 2.0181 3.1086 3.6018 4.6622 5.4400 5.6251 6.2426 6.5181 7.2478 7.4760 7.8859 7.9392 8.1028 8.5936 8.7173 9.3542 9.6443 10.0149 10.2631 10.9277 11.7124 12.3180 13.5037 14.2718 15.0934 15.5151 16.3084 16.7936 17.4764 17.8566 18.2482 18.5994 19.2241 19.5787 20.0110 20.7033 21.2918 21.6379 22.4163 23.0806 24.4161 25.6555 26.2225 26.3435 27.0934 29.1447 29.9496 30.9985 31.4798 32.2806 32.5500 33.1015 33.4191 34.1655 35.0278 35.0423 39.1618 39.4684 41.0831 41.6585 42.4898 44.0349 46.2411 46.6677 46.9866 48.2757 48.8366 49.4698 50.8885 51.3211 51.7006 51.9774 52.9259 54.5571 55.5918 55.8122 56.6076 58.4894 61.1627 62.1104 62.5757 64.6199 64.7660 66.2337 66.4721 68.0200 68.5540 69.5630 72.7293 73.6448 81.2331 85.3471 350.6901 362.2775 363.0825 366.2867 375.2239 376.1862 386.5739 511.9713 516.6324 electronvolt
chargesum: 2.0000000
charge: -0.591841 0.612443 -0.568398 0.395085 -0.239396 -0.196075 -0.149899 -0.192021 -0.229661 0.495965 0.509189 0.507731 0.320554 0.341096 0.349180 0.338408 0.297640
charge: -0.086678 0.260055 0.048604 0.017116 -0.059608 -0.077530 0.032651 -0.063842 -0.086903 0.346137 0.356921 0.366321 0.183499 0.196255 0.198596 0.194325 0.174079
qa: -0.5918 0.6124 -0.5684 0.3951 -0.2394 -0.1961 -0.1499 -0.1920 -0.2297 0.4960 0.5092 0.5077 0.3206 0.3411 0.3492 0.3384 0.2976
va: 3.2727 3.6719 3.3686 3.3511 3.7150 3.7684 3.6553 3.7766 3.7211 0.7365 0.7227 0.7264 0.8657 0.8577 0.8517 0.8590 0.8794
dispersion: -0.009314255 hartree
energy: -379.427129386624 hartree
dipole: 0.36029 3.45431 3.81460 0.78624 -1.53949 -0.75325 -0.40772 0.08428 -0.32344
magnitude: 3.90169 au
magnitude: 9.91730 debye
temp: 298.15 k
press: 1.00 atm
zeropoint: 0.14307940 hartree
thermalvibcorrection: 0.00500829 hartree
thermalrotcorrection: 0.00141627 hartree
thermaltrasncorrection: 0.00141627 hartree
thermaltotal: -379.27620916 hartree
thermalcorr: 0.00784083 hartree
nonthermalcorr: 0.14307940 hartree
totalcorr: 0.15092023 hartree
thermalcorrenthalpy: 0.00094421 hartree
totalenthalpy: -379.27526495 hartree
vibrat: 0.00837579 hartree
rotat: 0.01370317 hartree
transl: 0.01913129 hartree
total: 0.04121025 hartree
totalentropycorr: -0.04121025 hartree
gibbsenthalpy: -379.31647519 hartree
gibbsminuselec: 0.11065419 hartree
