program: Orca
programVersion: 5.0.4
elementType: N C C C C C C C F F N C C C C C C H H H H H H H H H H H H
charge: 0
multiplicity: 1
keywords: Freq RIJCOSX PBEh-3c
frequency: 0.00 0.00 0.00 0.00 0.00 0.00 15.20 32.22 35.79 89.71 125.47 144.47 199.43 269.15 285.32 313.38 331.73 335.29 372.68 427.22 428.07 436.33 440.26 539.12 541.67 578.02 631.74 643.86 652.98 692.82 698.53 728.87 730.11 794.40 794.94 864.34 869.11 882.82 908.80 940.70 943.37 991.69 1010.07 1010.34 1035.52 1035.72 1041.73 1042.22 1092.43 1093.22 1129.92 1150.67 1152.85 1178.33 1215.28 1215.33 1248.60 1249.22 1309.36 1333.82 1392.29 1394.72 1399.44 1408.74 1425.04 1520.12 1528.33 1575.26 1586.73 1603.68 1619.24 1710.23 1710.88 1733.97 1737.30 3254.39 3254.84 3267.53 3268.33 3276.72 3277.30 3291.60 3292.22 3308.15 3308.58 3709.62 3711.27
frequency: 15.20 32.22 35.79 89.71 125.47 144.47 199.43 269.15 285.32 313.38 331.73 335.29 372.68 427.22 428.07 436.33 440.26 539.12 541.67 578.02 631.74 643.86 652.98 692.82 698.53 728.87 730.11 794.40 794.94 864.34 869.11 882.82 908.80 940.70 943.37 991.69 1010.07 1010.34 1035.52 1035.72 1041.73 1042.22 1092.43 1093.22 1129.92 1150.67 1152.85 1178.33 1215.28 1215.33 1248.60 1249.22 1309.36 1333.82 1392.29 1394.72 1399.44 1408.74 1425.04 1520.12 1528.33 1575.26 1586.73 1603.68 1619.24 1710.23 1710.88 1733.97 1737.30 3254.39 3254.84 3267.53 3268.33 3276.72 3277.30 3291.60 3292.22 3308.15 3308.58 3709.62 3711.27
formula: C13H12F2N2
InChI: InChI=1/C13H12F2N2/c14-13(15,16-11-7-3-1-4-8-11)17-12-9-5-2-6-10-12/h1-10,16-17H
29 atoms
N  0.722382 1.012916 1.69642
C  1.529901 0.651332 0.616094
C  1.851645 1.640858 -0.312068
C  2.655821 1.354424 -1.400593
C  3.137476 0.069026 -1.59875
C  2.814065 -0.916808 -0.68058
C  2.029988 -0.635677 0.427569
C  0.009461 0.137358 2.514534
F  0.799695 -0.560596 3.392398
F  -0.764302 0.927379 3.327669
N  -0.715819 -0.821763 1.809626
C  -1.527425 -0.586114 0.698931
C  -2.037836 0.668994 0.374716
C  -2.830186 0.821773 -0.752372
C  -3.150568 -0.26147 -1.554677
C  -2.657221 -1.5139 -1.221163
C  -1.844476 -1.673888 -0.113301
H  0.825847 1.949658 2.048251
H  1.453705 2.640821 -0.186632
H  2.892927 2.139537 -2.106462
H  3.756889 -0.159713 -2.455136
H  3.189292 -1.92306 -0.814443
H  1.824657 -1.420501 1.139802
H  -0.809412 -1.715987 2.260573
H  -1.834853 1.527388 0.997172
H  -3.214687 1.804417 -0.992509
H  -3.777618 -0.132344 -2.426093
H  -2.892463 -2.373091 -1.835365
H  -1.437084 -2.650668 0.11889
totalener: -810.12569095 hartree
nucrepener: 1203.13375358 hartree
electener: -2013.25944453 hartree
oneelecener: -3495.76975393 hartree
twoeener: 1482.51030940 hartree
kineticenergy: 804.35606709 hartree
exchangeener: -58.701158718483 hartree
correlationener: -5.412850963153 hartree
xcener: -64.114009681636 hartree
energy: -683.1162 -683.1150 -399.0714 -399.0672 -290.4820 -285.6221 -285.6163 -284.2960 -284.2953 -284.2711 -284.2709 -284.2389 -284.2384 -284.1882 -284.1861 -284.0753 -284.0751 -37.7657 -35.8322 -29.5192 -28.1804 -25.9258 -25.7270 -23.1181 -22.8576 -22.8154 -22.6167 -20.6091 -19.1715 -18.9718 -18.9254 -18.2135 -17.6103 -17.2922 -16.9462 -16.3719 -15.7291 -15.1813 -15.0438 -14.0348 -13.9619 -13.9159 -13.7159 -13.5830 -13.3055 -13.1894 -13.0919 -12.8761 -12.6319 -12.1636 -11.7249 -11.3133 -11.2839 -10.9628 -10.8626 -9.9823 -9.9198 -8.0614 -7.9501 -7.1342 -7.0225 0.4429 0.6116 0.7345 0.7627 3.4991 3.7295 3.8834 4.0231 5.0956 5.2752 5.4941 5.6562 5.6949 5.9286 6.0937 6.2680 6.4560 6.5822 6.7760 6.9619 7.6701 8.0724 8.5303 8.6171 8.8878 8.9176 8.9469 9.3464 10.2967 10.4647 10.9984 11.6720 12.6900 12.8557 12.8701 13.0978 13.5835 14.5372 14.6900 15.2520 15.4827 15.4977 15.7595 16.0004 16.3211 16.4070 16.8042 16.8144 16.9938 17.0330 17.2023 17.3202 17.3227 17.4546 17.6773 17.7455 17.8856 17.9376 19.0272 19.2255 19.3525 19.6560 19.8891 20.2182 20.8713 21.1113 23.3769 23.6472 23.8520 24.7977 24.8443 25.2793 25.5933 25.6752 25.9715 25.9874 26.4349 26.6358 26.6513 27.1047 27.3089 27.4170 27.8052 28.1782 28.3516 28.6177 28.6892 28.8259 29.3477 29.3810 29.5547 29.9006 30.4472 30.9955 31.0803 31.4318 31.5172 31.6667 32.1285 32.2578 32.8590 33.0930 33.9078 34.0025 34.3985 35.2225 35.3601 35.5628 35.5793 35.6499 36.0587 36.8504 37.6158 37.8565 38.0466 39.0821 40.2014 40.4707 41.2231 41.3002 41.6693 41.9344 42.1609 42.2345 42.6439 42.7193 43.1918 43.2290 44.8877 45.0596 48.2748 48.5256 48.5370 48.9636 50.0183 50.6368 50.7727 51.0135 51.6251 51.8412 52.1008 52.2235 52.7769 54.0748 54.8991 55.1184 56.3517 56.4180 57.1462 57.6027 58.2035 58.3415 58.5316 58.8291 59.7226 59.8857 59.9189 60.0771 60.3816 60.4095 60.8703 61.5522 61.8152 63.0703 63.3838 64.1338 64.5762 64.8808 64.9669 65.7068 66.1780 66.8585 68.6935 69.2155 70.3201 71.6079 71.8458 72.4536 72.7929 73.1627 73.6756 74.6415 74.8557 75.4263 75.4931 75.5930 76.0994 76.3155 76.8038 77.4051 78.6621 80.2726 80.9635 81.2947 83.5227 84.3791 86.8280 88.6377 90.7444 95.0849 95.2685 359.8390 360.4945 371.8641 372.1263 372.2413 372.7204 382.7823 385.1258 385.3023 385.6777 385.9505 396.7362 396.7809 530.0746 530.3942 896.7957 900.6190 electronvolt
chargesum: 0.0000000
charge: -0.806077 0.389842 -0.296459 -0.210281 -0.238206 -0.210543 -0.263201 1.014126 -0.340418 -0.340512 -0.806435 0.391075 -0.262842 -0.211414 -0.238026 -0.210057 -0.296727 0.367066 0.216579 0.218293 0.216621 0.217843 0.231634 0.367082 0.231578 0.218119 0.216592 0.218205 0.216542
charge: -0.228076 0.031256 -0.158997 -0.123345 -0.156013 -0.122338 -0.157411 0.291854 -0.183882 -0.184102 -0.227707 0.030887 -0.156976 -0.122440 -0.155933 -0.123349 -0.159045 0.269152 0.134133 0.136569 0.135231 0.135871 0.141805 0.269155 0.141856 0.135940 0.135226 0.136546 0.134131
qa: -0.8061 0.3898 -0.2965 -0.2103 -0.2382 -0.2105 -0.2632 1.0141 -0.3404 -0.3405 -0.8064 0.3911 -0.2628 -0.2114 -0.2380 -0.2101 -0.2967 0.3671 0.2166 0.2183 0.2166 0.2178 0.2316 0.3671 0.2316 0.2181 0.2166 0.2182 0.2165
va: 2.9141 3.6467 3.8225 3.8531 3.8198 3.8415 3.8097 4.0586 1.0663 1.0664 2.9142 3.6460 3.8105 3.8414 3.8199 3.8528 3.8224 0.8493 0.9118 0.9116 0.9128 0.9118 0.9183 0.8494 0.9181 0.9117 0.9128 0.9117 0.9119
dispersion: -0.020370394 hartree
energy: -810.085906654584 hartree
dipole: -0.07460 0.07346 -0.00114 -0.89011 0.86358 -0.02653 -15.68052 15.22561 -0.45491
magnitude: 0.45568 au
magnitude: 1.15826 debye
temp: 298.15 k
press: 1.00 atm
zeropoint: 0.23424294 hartree
thermalvibcorrection: 0.01122623 hartree
thermalrotcorrection: 0.00141627 hartree
thermaltrasncorrection: 0.00141627 hartree
thermaltotal: -809.83760493 hartree
thermalcorr: 0.01405878 hartree
nonthermalcorr: 0.23424294 hartree
totalcorr: 0.24830172 hartree
thermalcorrenthalpy: 0.00094421 hartree
totalenthalpy: -809.83666072 hartree
vibrat: 0.01972639 hartree
rotat: 0.01556197 hartree
transl: 0.02007679 hartree
total: 0.05536516 hartree
totalentropycorr: -0.05536516 hartree
gibbsenthalpy: -809.89202588 hartree
gibbsminuselec: 0.19388078 hartree
