program: Orca
programVersion: 5.0.4
elementType: N C C C C C C C N C C C C C C O H H H H H H H H H H H H
charge: 0
multiplicity: 1
keywords: SP DSD-BLYP D3BJ def2-QZVPP def2-QZVPP/C def2/J TightSCF
formula: C13H12N2O
InChI: InChI=1/C13H12N2O/c16-13(14-11-7-3-1-4-8-11)15-12-9-5-2-6-10-12/h1-10,14-15H
28 atoms
N  -1.055583 -0.735352 0.417199
C  -2.420868 -0.567767 0.165989
C  -3.2717 -1.564708 0.648235
C  -4.638593 -1.48818 0.454356
C  -5.189361 -0.413581 -0.226563
C  -4.345561 0.575698 -0.704512
C  -2.972772 0.515231 -0.518114
C  -0.007519 0.05597 0.007005
N  1.205746 -0.434908 0.43113
C  2.484591 0.074774 0.18612
C  2.748545 1.231828 -0.546902
C  4.062116 1.637044 -0.729903
C  5.124446 0.921878 -0.201365
C  4.859221 -0.225741 0.529761
C  3.555444 -0.644171 0.721765
O  -0.137992 1.063751 -0.64753
H  -0.839195 -1.56695 0.939948
H  -2.860436 -2.415523 1.181273
H  -5.273272 -2.275995 0.838091
H  -6.257504 -0.349888 -0.382072
H  -4.757475 1.42251 -1.237785
H  -2.34473 1.300522 -0.902889
H  1.204299 -1.278218 0.979685
H  1.944197 1.809575 -0.969188
H  4.2504 2.536466 -1.301472
H  6.142402 1.252349 -0.355607
H  5.669641 -0.802933 0.954863
H  3.368469 -1.545059 1.296511
totalener: -685.45199964 hartree
nucrepener: 966.23623257 hartree
electener: -1651.68823221 hartree
oneelecener: -2846.67492987 hartree
twoeener: 1194.98669767 hartree
kineticenergy: 683.65322827 hartree
exchangeener: -28.998864309529 hartree
correlationener: -2.064124555492 hartree
xcener: -31.062988865021 hartree
chargesum: -0.0000000
charge: -0.367597 0.233177 -0.112038 -0.100847 -0.134726 -0.105353 -0.035132 0.438062 -0.363641 0.236927 -0.041360 -0.103966 -0.134723 -0.103497 -0.110856 -0.473626 0.182023 0.053418 0.088389 0.088888 0.097903 0.128945 0.180405 0.132934 0.096394 0.088528 0.090670 0.050701
charge: 0.566210 -0.196190 0.061090 0.058979 0.052713 0.066274 0.090968 -0.757444 0.566109 -0.196147 0.090982 0.066408 0.052674 0.059005 0.061159 0.298803 -0.159317 -0.064225 -0.058337 -0.064102 -0.056373 -0.068536 -0.159019 -0.068542 -0.056416 -0.064102 -0.058304 -0.064317
qa: -0.3676 0.2332 -0.1120 -0.1008 -0.1347 -0.1054 -0.0351 0.4381 -0.3636 0.2369 -0.0414 -0.1040 -0.1347 -0.1035 -0.1109 -0.4736 0.1820 0.0534 0.0884 0.0889 0.0979 0.1289 0.1804 0.1329 0.0964 0.0885 0.0907 0.0507
va: 3.0809 3.5838 3.7460 3.8377 3.8481 3.7893 3.6738 4.2019 3.0790 3.5811 3.6726 3.7842 3.8478 3.8364 3.7387 1.9686 1.0342 1.0024 0.9865 0.9901 0.9844 1.0012 1.0352 1.0001 0.9844 0.9899 0.9859 1.0027
total: -686.853721995 hartree
dispersion: -0.021366568 hartree
energy: -686.875088563079 hartree
dipole: 0.23032 -0.06872 0.16160 -1.78553 0.54441 -1.24112 0.97205 -0.18445 0.78760
magnitude: 1.47879 au
magnitude: 3.75878 debye
