program: Orca
programVersion: 5.0.4
elementType: N C C C C C C C N C C C C C C H H H H H H H H H H H H
charge: 2
multiplicity: 1
keywords: Freq RIJCOSX PBEh-3c
frequency: 0.00 0.00 0.00 0.00 0.00 0.00 33.16 34.56 37.64 109.97 117.55 238.87 273.41 293.81 305.73 370.93 405.97 407.27 465.08 501.92 529.45 622.48 622.88 629.16 655.26 682.55 684.10 779.86 793.31 821.47 824.91 839.18 845.10 861.59 922.46 982.14 984.13 1038.03 1038.17 1041.51 1042.11 1069.43 1070.76 1073.13 1073.15 1137.91 1160.37 1172.70 1181.77 1222.77 1237.97 1238.22 1255.10 1261.33 1372.34 1386.45 1426.44 1430.13 1469.65 1503.87 1554.51 1555.82 1570.04 1583.04 1678.37 1686.71 1692.45 1694.44 2197.71 3257.57 3258.13 3260.39 3260.57 3295.65 3295.83 3305.86 3305.93 3310.85 3310.99 3387.20 3399.35
frequency: 33.16 34.56 37.64 109.97 117.55 238.87 273.41 293.81 305.73 370.93 405.97 407.27 465.08 501.92 529.45 622.48 622.88 629.16 655.26 682.55 684.10 779.86 793.31 821.47 824.91 839.18 845.10 861.59 922.46 982.14 984.13 1038.03 1038.17 1041.51 1042.11 1069.43 1070.76 1073.13 1073.15 1137.91 1160.37 1172.70 1181.77 1222.77 1237.97 1238.22 1255.10 1261.33 1372.34 1386.45 1426.44 1430.13 1469.65 1503.87 1554.51 1555.82 1570.04 1583.04 1678.37 1686.71 1692.45 1694.44 2197.71 3257.57 3258.13 3260.39 3260.57 3295.65 3295.83 3305.86 3305.93 3310.85 3310.99 3387.20 3399.35
formula: C13H12N2
InChI: InChI=1/C13H12N2/c1-3-7-12(8-4-1)14-11-15-13-9-5-2-6-10-13/h1-10,14-15H
27 atoms
N  -1.195892 0.318023 1.201577
C  -2.320523 0.059848 0.375477
C  -2.260661 0.279923 -1.000667
C  -3.390759 0.01792 -1.741972
C  -4.548639 -0.453433 -1.117105
C  -4.584417 -0.66826 0.255488
C  -3.463314 -0.412629 1.020823
C  -0.061983 0.745125 0.905477
N  1.073058 1.198914 0.657079
C  2.273371 0.519679 0.322236
C  2.296272 -0.869706 0.201214
C  3.496337 -1.466096 -0.114226
C  4.641115 -0.687219 -0.303726
C  4.594053 0.696203 -0.180696
C  3.401571 1.318096 0.134348
H  -1.348125 0.120957 2.202886
H  -1.365955 0.645624 -1.491528
H  -3.380281 0.178985 -2.810795
H  -5.429433 -0.65361 -1.712408
H  -5.484748 -1.033359 0.729148
H  -3.489757 -0.577745 2.092539
H  1.16155 2.225785 0.702645
H  1.41155 -1.47981 0.343119
H  3.550469 -2.540819 -0.216464
H  5.576922 -1.170071 -0.5514
H  5.484881 1.289942 -0.329597
H  3.363339 2.397531 0.233329
totalener: -610.03143744 hartree
nucrepener: 847.37398899 hartree
electener: -1457.40542643 hartree
oneelecener: -2472.88025471 hartree
twoeener: 1015.47482828 hartree
kineticenergy: 605.43650730 hartree
exchangeener: -47.031872510811 hartree
correlationener: -4.443365098389 hartree
xcener: -51.475237609200 hartree
energy: -411.7828 -411.7815 -298.1179 -294.1895 -294.1893 -292.5275 -292.5263 -292.4768 -292.4760 -291.8807 -291.8796 -291.8076 -291.8071 -291.6979 -291.6974 -41.2911 -39.9739 -34.3770 -34.0917 -32.0153 -31.3149 -30.8774 -30.8733 -29.4444 -28.7291 -27.8376 -27.8015 -26.0853 -25.9948 -25.0630 -25.0314 -23.2324 -23.2293 -22.9235 -22.8674 -21.9016 -21.8653 -21.0897 -21.0846 -20.9725 -20.9676 -19.1525 -19.1433 -18.8308 -18.8055 -18.5676 -18.5521 -15.7648 -15.7615 -15.7248 -15.7081 -10.8867 -10.8729 -7.0271 -6.9952 -6.8499 -6.7758 -6.4806 -5.2612 -4.2317 -3.3893 -3.2636 -2.0657 -2.0581 -1.6593 -1.4359 -1.1682 -1.0647 -0.7485 -0.6194 -0.2675 -0.2585 -0.1382 0.3477 1.2935 1.3967 1.7165 1.8030 2.0078 2.0642 2.9112 2.9404 3.3817 4.0653 4.6048 5.2148 5.7951 6.3618 7.0392 7.0571 7.7354 7.8216 8.3776 8.4111 8.4986 8.6433 8.9246 8.9457 9.3136 9.3187 9.3889 9.4260 9.7101 9.7492 10.0358 10.0650 10.4536 10.5525 10.6129 10.6338 11.3796 11.5052 12.0823 12.1179 12.9359 12.9484 13.1565 13.6175 14.0408 15.9975 16.3119 16.5177 17.2162 17.5701 18.1614 18.6078 18.6149 18.8239 19.2016 19.4651 19.5902 19.9295 20.4695 20.6360 20.7664 21.0364 21.1123 21.2560 21.7524 22.2859 22.6104 22.8017 22.8309 23.0630 23.3164 24.2328 24.2809 24.9631 25.1231 26.6723 27.3224 27.3469 27.7072 28.0616 28.2625 28.4237 29.0685 30.9216 31.7813 32.6190 32.7934 33.3694 33.4135 34.4477 34.4891 34.4995 34.5842 34.8133 34.8377 35.5029 36.1967 36.7175 37.3554 38.0233 40.3121 41.5781 41.8307 42.6686 42.7463 42.9901 43.5916 45.1748 46.0855 47.2564 47.2879 48.0638 48.1230 49.3065 49.9940 50.1971 50.6382 50.7849 51.7506 51.9616 52.1714 52.4553 52.6637 52.7019 52.7546 54.5358 54.8225 55.5905 56.7304 56.8315 56.8521 57.0095 57.4822 58.3061 59.3419 59.6084 61.9660 63.7693 63.9743 64.0804 64.0871 66.0013 66.0455 66.9091 66.9505 67.4452 67.6264 68.1136 68.1508 69.0878 70.2678 70.4268 72.2710 74.4139 75.1794 76.2087 81.4016 84.4699 87.2249 87.3762 351.9300 352.5252 363.9024 364.0759 364.1810 364.3309 373.6564 377.0524 377.3293 377.4485 377.8693 388.3825 388.6738 517.4646 521.4452 electronvolt
chargesum: 2.0000000
charge: -0.576200 0.351852 -0.245897 -0.204304 -0.174382 -0.206985 -0.258406 0.617238 -0.576611 0.350963 -0.246038 -0.204297 -0.174177 -0.207263 -0.257092 0.485990 0.271471 0.313757 0.321315 0.318361 0.295009 0.486171 0.271241 0.313585 0.321205 0.318409 0.295085
charge: 0.040282 -0.009583 -0.112377 -0.075019 -0.028465 -0.082758 -0.092609 0.250074 0.040167 -0.009466 -0.112669 -0.075006 -0.028565 -0.082640 -0.092514 0.351115 0.161959 0.181625 0.185234 0.184317 0.171372 0.351124 0.161829 0.181563 0.185212 0.184340 0.171460
qa: -0.5762 0.3519 -0.2459 -0.2043 -0.1744 -0.2070 -0.2584 0.6172 -0.5766 0.3510 -0.2460 -0.2043 -0.1742 -0.2073 -0.2571 0.4860 0.2715 0.3138 0.3213 0.3184 0.2950 0.4862 0.2712 0.3136 0.3212 0.3184 0.2951
va: 3.3764 3.3549 3.7412 3.8101 3.7181 3.8027 3.7402 3.7522 3.3763 3.3551 3.7412 3.8105 3.7181 3.8028 3.7396 0.7440 0.8909 0.8722 0.8676 0.8700 0.8787 0.7439 0.8909 0.8722 0.8677 0.8699 0.8786
dispersion: -0.017235782 hartree
energy: -610.009802106378 hartree
dipole: 0.09255 -0.16761 -0.07507 -1.10201 2.05227 0.95026 -1.33892 2.52296 1.18404
magnitude: 1.52006 au
magnitude: 3.86369 debye
temp: 298.15 k
press: 1.00 atm
zeropoint: 0.22654244 hartree
thermalvibcorrection: 0.00933174 hartree
thermalrotcorrection: 0.00141627 hartree
thermaltrasncorrection: 0.00141627 hartree
thermaltotal: -609.77109539 hartree
thermalcorr: 0.01216428 hartree
nonthermalcorr: 0.22654244 hartree
totalcorr: 0.23870672 hartree
thermalcorrenthalpy: 0.00094421 hartree
totalenthalpy: -609.77015118 hartree
vibrat: 0.01617023 hartree
rotat: 0.01541397 hartree
transl: 0.01982614 hartree
total: 0.05141034 hartree
totalentropycorr: -0.05141034 hartree
gibbsenthalpy: -609.82156152 hartree
gibbsminuselec: 0.18824058 hartree
