program: Gaussian 09
title: 000076554
version: EM64L-G09RevD.01
frameworkgroup: C1[X(C6H2Cl2FNO2)]
method: RPBEPBE
basis: SDD
operation: Freq
keyword: #p
keyword: freq=noraman
keyword: PBEPBE/SDD
title: #p freq=noraman PBEPBE/SDD
converged: NO YES NO YES
title: Mulliken charges:
elementType: Cl Cl F O O N C C C C C C H H
charge: 0.039530 0.039530 -0.136756 -0.189190 -0.189193 0.021840 0.443599 -0.361812 -0.361810 -0.240462 -0.240462 0.537806 0.318690 0.318690
chargesum: 0.00000
title: Mulliken charges with hydrogens summed into heavy atoms:
elementType: Cl Cl F O O N C C C C C C
charge: 0.039530 0.039530 -0.136756 -0.189190 -0.189193 0.021840 0.443599 -0.043122 -0.043120 -0.240462 -0.240462 0.537806
polarizability: 1.36535952e+02 3.11699206e-05 1.34382091e+02 4.22460394e-03 -4.21385019e-03 3.54055696e+01
1716.lowfreq: -7.5693 -4.3054 -2.2297 -0.0019 -0.0012 0.0014 56.3994 98.0589 120.6151
frequency: 56.3990 98.0589 120.6151 156.2172 173.2663 207.0380 251.4058 323.3494 334.4983 349.8671 362.5884 502.5982 503.7021 529.8365 576.2966 652.7869 700.9970 725.0512 756.0763 769.0289 871.6458 907.4953 919.5242 1045.3001 1113.7170 1182.8220 1209.5518 1240.4503 1367.2725 1388.3815 1410.5704 1437.0582 1581.5868 1587.2107 3192.5294 3193.6910
redmass: 16.5492 19.4872 11.5142 17.5490 24.8642 4.9830 17.7839 9.9829 16.6650 13.5035 18.5797 5.1005 10.0383 5.0240 5.8983 12.9906 8.1843 5.6528 8.9635 11.5106 10.1079 1.3474 1.4789 2.5289 3.7184 1.3775 10.0037 4.1820 6.4865 10.4743 7.5643 4.0982 8.3003 9.9151 1.0928 1.0937
irintensity: 0.0000 0.9943 3.6785 2.3689 0.0158 0.0000 1.4538 2.4745 0.1560 1.5965 0.2809 0.0001 4.6772 0.1318 0.0115 52.1267 9.1419 16.3940 0.4945 90.0707 8.3996 0.0000 44.0886 4.8710 34.0299 0.1073 221.1679 172.6296 15.1025 15.5031 171.5695 93.9374 5.8655 31.2577 13.1116 14.3909
temp: 298.150 k
press: 1.00000 atm
elementType: 17 17 9 8 8 7 6 6 6 6 6 6 1 1
symmnumber: 1
zpe: 190197.2 jmol-1
zpe.correction: 0.072442 hartree
zpe.thermalcorrener: 0.082931 hartree
zpe.thermalcorrenthalpy: 0.083876 hartree
zpe.thermalcorrgfe: 0.034763 hartree
zpe.sumelectzpe: -1454.042377 hartree
zpe.sumelectthermal: -1454.031888 hartree
zpe.sumelectthermalent: -1454.030943 hartree
zpe.sumelectthermalfe: -1454.080056 hartree
dipole: 1.6207 0.0000 0.0016
dipole: 1.6207
quadrupole: -100.7671 -79.4790 -79.8679
quadrupole: -0.0001 -0.0054 -0.0006
quadrupole: -14.0625 7.2257 6.8367 -0.0001 -0.0054 -0.0006
hfenergy: -1454.1148191 hartree
pointgroup: C01[X(C6H2Cl2F1N1O2)]
dipole: 0.6376305 -0.0000583 -0.0006389 debye
dipolederiv: -0.2204483 -0.2620538 0.0000161 -0.3059059 -0.5260533 0.0000301 0.0000228 0.0000088 0.0009396 -0.2203503 0.2620012 -0.0000184 0.3058527 -0.5261515 0.0000396 -0.000014 0.0000564 0.0009394 -1.0180731 0.0000765 -0.0000383 0.0000773 -0.1248962 0.0000021 -0.0000786 0.0000049 -0.0983047 -0.7086506 -0.1949739 -0.0000386 -0.1814672 -0.6443937 -0.0002466 0.0002376 0.0002727 -0.2139449 -0.7085846 0.1949823 -0.0000118 0.1814734 -0.6444535 0.0001668 0.0002496 -0.0003303 -0.2139472 1.8088419 -0.0000626 -0.0001163 -0.0000604 1.0384099 0.0001004 -0.0001378 0.0000703 0.1889794 -0.6439445 0.0000681 0.0001284 0.00007 0.1563337 -0.0000305 -0.0001527 -0.0000204 0.0631868 -0.0095203 0.1674977 0.0000089 -0.0838794 -0.2433936 0.0000317 -0.0001235 0.0000209 -0.0603287 -0.0095386 -0.1675385 0.0000178 0.0838376 -0.2433781 -0.0000074 -0.0001099 0.0000207 -0.0603283 0.1770789 0.4912426 -0.0000173 0.6880424 0.83795 -0.0000482 -0.0000224 -0.0000046 -0.0687031 0.1768714 -0.4911283 0.0000432 -0.68793 0.8381527 -0.0000716 0.0000609 -0.0001066 -0.0687032 1.0788898 -0.0001048 0.000048 -0.0001036 -0.1385042 0.0000209 0.0000695 0.0000124 0.1648187 0.1487118 -0.0319997 -0.0000106 0.0053156 0.1101912 0.0000029 0.0000032 0.0000034 0.1826981 0.1487165 0.0319932 -0.0000111 -0.0053225 0.1101867 0.0000098 -0.0000048 -0.0000086 0.182698 unknown
polarizability: 136.5359522|-0.0002147|134.3820908|-0.004225|-0.0042135|35.4055696 unknown
InChI: InChI=1S/C6H2Cl2FNO2/c7-4-1-3(10(11)12)2-5(8)6(4)9/h1-2H
charge 0 multiplicity 1
14 atoms
Cl 1.943817 2.769337 -0.000076
Cl 1.943339 -2.769665 0.000287
F  3.10634 -0.000265 0.00021
O  -3.143201 -1.141145 0.00048
O  -3.143006 1.141692 0.000639
N  -2.543822 0.00022 -0.000255
C  -1.05742 0.000094 -0.00011
C  -0.384062 -1.239336 0.000033
C  -0.383847 1.23941 -0.000123
C  1.019967 1.226184 -0.000025
C  1.019755 -1.226352 0.000143
C  1.720848 -0.000145 0.000113
H  -0.95279 -2.171939 0.00001
H  -0.952417 2.17211 -0.000224
