program: Orca
programVersion: 5.0.4
elementType: N C C C C C C C F N C C C C C C C C C C C C H H H H H H H H H H H H H H H H
charge: 1
multiplicity: 1
keywords: Freq RIJCOSX PBEh-3c
frequency: 0.00 0.00 0.00 0.00 0.00 0.00 23.55 35.07 35.23 44.14 52.83 60.37 86.13 115.26 131.27 224.57 249.34 270.24 290.29 312.24 380.12 408.70 426.81 427.83 428.96 492.04 506.84 524.12 543.47 595.21 636.20 639.10 645.84 653.82 671.90 694.69 727.89 729.11 736.31 764.83 778.10 801.62 802.52 840.61 883.25 885.98 890.61 897.28 970.40 981.06 985.57 994.40 1033.85 1034.99 1038.40 1046.08 1046.52 1048.13 1067.53 1068.63 1069.12 1073.45 1084.39 1086.72 1098.40 1142.74 1143.94 1146.39 1223.94 1224.18 1224.63 1235.79 1236.73 1239.16 1258.12 1297.19 1342.12 1377.55 1380.64 1383.17 1402.48 1402.90 1403.32 1486.76 1540.01 1541.53 1544.40 1582.13 1583.78 1589.23 1638.30 1710.07 1713.10 1713.74 1715.74 1716.67 1720.71 1789.98 3267.49 3269.43 3275.70 3277.58 3278.72 3279.73 3287.47 3288.35 3288.43 3296.87 3297.08 3297.52 3304.80 3305.15 3305.22 3623.67
frequency: 23.55 35.07 35.23 44.14 52.83 60.37 86.13 115.26 131.27 224.57 249.34 270.24 290.29 312.24 380.12 408.70 426.81 427.83 428.96 492.04 506.84 524.12 543.47 595.21 636.20 639.10 645.84 653.82 671.90 694.69 727.89 729.11 736.31 764.83 778.10 801.62 802.52 840.61 883.25 885.98 890.61 897.28 970.40 981.06 985.57 994.40 1033.85 1034.99 1038.40 1046.08 1046.52 1048.13 1067.53 1068.63 1069.12 1073.45 1084.39 1086.72 1098.40 1142.74 1143.94 1146.39 1223.94 1224.18 1224.63 1235.79 1236.73 1239.16 1258.12 1297.19 1342.12 1377.55 1380.64 1383.17 1402.48 1402.90 1403.32 1486.76 1540.01 1541.53 1544.40 1582.13 1583.78 1589.23 1638.30 1710.07 1713.10 1713.74 1715.74 1716.67 1720.71 1789.98 3267.49 3269.43 3275.70 3277.58 3278.72 3279.73 3287.47 3288.35 3288.43 3296.87 3297.08 3297.52 3304.80 3305.15 3305.22 3623.67
formula: C19H16FN2
InChI: InChI=1/C19H16FN2/c20-19(21-16-10-4-1-5-11-16)22(17-12-6-2-7-13-17)18-14-8-3-9-15-18/h1-15,21H
38 atoms
N  1.429509 0.400945 -0.285795
C  2.836651 0.281317 -0.026134
C  3.521559 -0.844906 -0.453437
C  4.883608 -0.932418 -0.213525
C  5.545151 0.10174 0.432358
C  4.848295 1.228244 0.844472
C  3.483823 1.321379 0.621194
C  0.509173 -0.298516 0.329734
F  0.9207 -1.169459 1.191953
N  -0.784709 -0.197019 0.145295
C  -1.708376 -1.118778 0.756955
C  -2.600457 -0.638888 1.701773
C  -3.523788 -1.510825 2.254969
C  -3.546271 -2.842666 1.865774
C  -2.648487 -3.307795 0.916501
C  -1.724718 -2.443286 0.35054
C  -1.306417 0.825454 -0.720791
C  -1.848402 0.461365 -1.944058
C  -2.373028 1.446226 -2.765828
C  -2.35157 2.77476 -2.364524
C  -1.811908 3.125713 -1.135575
C  -1.289181 2.148788 -0.301347
H  1.114606 1.081906 -0.966642
H  3.006284 -1.63959 -0.977174
H  5.428482 -1.807554 -0.538972
H  6.608882 0.03084 0.612545
H  5.364705 2.034376 1.346551
H  2.932192 2.192681 0.950117
H  -2.582192 0.401801 1.998018
H  -4.225283 -1.148081 2.993186
H  -4.268979 -3.518833 2.301248
H  -2.669395 -4.343968 0.608922
H  -1.036625 -2.802156 -0.40462
H  -1.873604 -0.578003 -2.244803
H  -2.801599 1.173785 -3.720264
H  -2.764113 3.538575 -3.009058
H  -1.807434 4.159382 -0.818748
H  -0.886886 2.413365 0.669093
totalener: -940.76247670 hartree
nucrepener: 1668.53387659 hartree
electener: -2609.29635329 hartree
oneelecener: -4570.99053188 hartree
twoeener: 1961.69417859 hartree
kineticenergy: 933.73494322 hartree
exchangeener: -71.037113653734 hartree
correlationener: -6.676906850349 hartree
xcener: -77.714020504083 hartree
chargesum: 1.0000000
charge: -0.736889 0.268822 -0.227900 -0.223540 -0.202383 -0.221991 -0.234861 0.910299 -0.207649 -0.645873 0.277651 -0.225286 -0.220108 -0.204036 -0.222709 -0.247967 0.191658 -0.211535 -0.222669 -0.202449 -0.222964 -0.252098 0.434700 0.243210 0.260735 0.262600 0.261111 0.244455 0.246661 0.260864 0.262042 0.259662 0.237049 0.256897 0.266781 0.267360 0.264809 0.255541
charge: -0.134537 -0.017803 -0.122878 -0.109669 -0.100615 -0.109183 -0.125478 0.312137 -0.036186 -0.018886 -0.000964 -0.116979 -0.107303 -0.101666 -0.110003 -0.131171 -0.020336 -0.116051 -0.105667 -0.099783 -0.111041 -0.142092 0.304761 0.149986 0.155976 0.156647 0.156002 0.150142 0.153121 0.156088 0.156480 0.155589 0.147047 0.157332 0.158631 0.158771 0.157617 0.151967
qa: -0.7369 0.2688 -0.2279 -0.2235 -0.2024 -0.2220 -0.2349 0.9103 -0.2076 -0.6459 0.2777 -0.2253 -0.2201 -0.2040 -0.2227 -0.2480 0.1917 -0.2115 -0.2227 -0.2024 -0.2230 -0.2521 0.4347 0.2432 0.2607 0.2626 0.2611 0.2445 0.2467 0.2609 0.2620 0.2597 0.2370 0.2569 0.2668 0.2674 0.2648 0.2555
va: 3.0696 3.5877 3.8151 3.8175 3.7831 3.8121 3.7971 3.7843 1.2273 3.1438 3.5964 3.7995 3.8078 3.7842 3.8185 3.8117 3.6161 3.7841 3.8004 3.7782 3.8077 3.7852 0.7956 0.9035 0.8967 0.8958 0.8968 0.9037 0.9040 0.8970 0.8960 0.8973 0.9066 0.9001 0.8946 0.8938 0.8954 0.8987
dispersion: -0.028317608 hartree
energy: -940.731137390498 hartree
dipole: -1.90095 1.99380 0.09285 3.20806 -2.70560 0.50246 -3.25993 2.75613 -0.50379
magnitude: 0.71756 au
magnitude: 1.82391 debye
temp: 298.15 k
press: 1.00 atm
zeropoint: 0.31590504 hartree
thermalvibcorrection: 0.01458321 hartree
thermalrotcorrection: 0.00141627 hartree
thermaltrasncorrection: 0.00141627 hartree
thermaltotal: -940.39781660 hartree
thermalcorr: 0.01741575 hartree
nonthermalcorr: 0.31590504 hartree
totalcorr: 0.33332079 hartree
thermalcorrenthalpy: 0.00094421 hartree
totalenthalpy: -940.39687239 hartree
vibrat: 0.02580194 hartree
rotat: 0.01645494 hartree
transl: 0.02038573 hartree
total: 0.06264261 hartree
totalentropycorr: -0.06264261 hartree
gibbsenthalpy: -940.45951500 hartree
gibbsminuselec: 0.27162239 hartree
