program: Orca
programVersion: 5.0.4
elementType: N C C C C C C C F F N C C C C C C C C C C C C H H H H H H H H H H H H H H H H
charge: 0
multiplicity: 1
keywords: Opt RIJCOSX PBEh-3c
formula: C19H16F2N2
InChI: InChI=1/C19H16F2N2/c20-19(21,22-16-10-4-1-5-11-16)23(17-12-6-2-7-13-17)18-14-8-3-9-15-18/h1-15,22H
39 atoms
N  1.290747 -1.365253 -1.064286
C  2.226146 -1.172961 -0.056108
C  2.863921 -2.301552 0.462912
C  3.790262 -2.185887 1.4833
C  4.092949 -0.944746 2.023705
C  3.460089 0.176356 1.511287
C  2.541474 0.078506 0.477234
C  0.465941 -0.377228 -1.61415
F  1.168167 0.613818 -2.223752
F  -0.21452 -0.997742 -2.635061
N  -0.389013 0.218435 -0.667142
C  -0.91089 1.526626 -0.864556
C  -1.388013 1.983325 -2.0892
C  -1.902001 3.267152 -2.196161
C  -1.9668 4.097312 -1.087825
C  -1.504359 3.637304 0.136357
C  -0.970965 2.364012 0.244978
C  -1.18959 -0.655386 0.133478
C  -2.453411 -1.031109 -0.307589
C  -3.250793 -1.847447 0.477954
C  -2.788477 -2.299126 1.705523
C  -1.529234 -1.922816 2.146977
C  -0.731733 -1.098717 1.367191
H  1.350838 -2.220628 -1.589368
H  2.62025 -3.281833 0.070193
H  4.270239 -3.077714 1.864472
H  4.811625 -0.853635 2.826382
H  3.687623 1.155629 1.912039
H  2.086212 0.980973 0.097919
H  -1.367202 1.344985 -2.961596
H  -2.26328 3.615369 -3.154845
H  -2.374823 5.095199 -1.176769
H  -1.548045 4.275094 1.009389
H  -0.600259 2.005936 1.19709
H  -2.818193 -0.670178 -1.260548
H  -4.234814 -2.132071 0.129638
H  -3.411215 -2.936949 2.318786
H  -1.165028 -2.265359 3.106462
H  0.246274 -0.797897 1.718091
totalener: -1040.66280559 hartree
nucrepener: 1923.82152691 hartree
electener: -2964.48433251 hartree
oneelecener: -5242.70457945 hartree
twoeener: 2278.22024695 hartree
kineticenergy: 1033.06846630 hartree
exchangeener: -76.845656399669 hartree
correlationener: -7.161238636820 hartree
xcener: -84.006895036489 hartree
dispersion: -0.030910436 hartree
dispersion: -0.030925445 hartree
dispersion: -0.030916391 hartree
dispersion: -0.030931684 hartree
chargesum: 0.0000000
charge: -0.810830 0.381675 -0.306070 -0.211880 -0.244330 -0.214583 -0.294352 1.048495 -0.326030 -0.347400 -0.719522 0.311390 -0.268567 -0.220778 -0.226652 -0.216877 -0.251514 0.272972 -0.219283 -0.223448 -0.220566 -0.228260 -0.249391 0.368606 0.216891 0.219107 0.216717 0.221518 0.256765 0.236951 0.221736 0.220343 0.220570 0.233342 0.230808 0.222176 0.221484 0.223250 0.255535
charge: -0.218638 0.034126 -0.167474 -0.122704 -0.164694 -0.122634 -0.174279 0.307699 -0.157836 -0.186066 -0.121870 0.023131 -0.143531 -0.128886 -0.140321 -0.129393 -0.131588 0.013474 -0.122665 -0.132983 -0.132164 -0.132781 -0.125359 0.270816 0.134073 0.136708 0.135147 0.137077 0.149779 0.145332 0.137521 0.136554 0.137509 0.144825 0.145823 0.137783 0.136954 0.138418 0.153115
qa: -0.8108 0.3817 -0.3061 -0.2119 -0.2443 -0.2146 -0.2944 1.0485 -0.3260 -0.3474 -0.7195 0.3114 -0.2686 -0.2208 -0.2267 -0.2169 -0.2515 0.2730 -0.2193 -0.2234 -0.2206 -0.2283 -0.2494 0.3686 0.2169 0.2191 0.2167 0.2215 0.2568 0.2370 0.2217 0.2203 0.2206 0.2333 0.2308 0.2222 0.2215 0.2232 0.2555
va: 2.9384 3.6632 3.8191 3.8588 3.8154 3.8388 3.7966 3.9780 1.0771 1.0608 2.9289 3.7336 3.8037 3.8190 3.8155 3.8189 3.8136 3.7154 3.8008 3.8110 3.8103 3.8129 3.8164 0.8508 0.9117 0.9113 0.9131 0.9108 0.9056 0.9150 0.9110 0.9114 0.9114 0.9094 0.9119 0.9110 0.9109 0.9111 0.8970
dispersion: -0.030931143 hartree
energy: -1040.619985701032 hartree
dipole: -2.23509 1.88177 -0.35332 0.89335 -1.25947 -0.36612 12.89092 -12.40535 0.48558
magnitude: 0.70332 au
magnitude: 1.78771 debye
