program: Orca
programVersion: 5.0.4
elementType: N C C C C C C C N C C C C C C C C C C C C O H H H H H H H H H H H H H H H H
charge: 0
multiplicity: 1
keywords: Freq RIJCOSX PBEh-3c
frequency: 0.00 0.00 0.00 0.00 0.00 0.00 22.01 32.96 35.99 46.44 54.57 66.33 89.87 118.79 174.16 226.72 255.00 259.62 275.39 325.08 370.39 417.69 428.18 429.11 433.21 462.22 532.08 536.06 541.71 567.00 596.81 642.70 643.96 648.28 671.85 710.42 728.54 731.80 739.30 781.65 799.24 801.00 805.50 852.67 874.80 880.07 892.64 904.69 951.15 960.10 972.27 995.59 1014.99 1018.69 1030.93 1040.01 1040.98 1041.81 1046.52 1047.02 1051.17 1079.71 1090.32 1091.57 1108.59 1140.39 1148.28 1156.07 1214.91 1215.61 1215.99 1236.14 1244.06 1246.34 1274.98 1317.70 1354.63 1359.53 1389.17 1398.48 1399.83 1405.86 1407.18 1410.67 1529.09 1536.20 1542.33 1588.19 1591.69 1594.75 1641.48 1701.56 1709.28 1714.76 1721.80 1728.98 1731.61 1879.89 3241.47 3264.99 3267.40 3267.83 3272.46 3272.65 3276.63 3280.24 3280.60 3286.60 3290.39 3291.88 3295.10 3299.05 3343.89 3686.37
frequency: 22.01 32.96 35.99 46.44 54.57 66.33 89.87 118.79 174.16 226.72 255.00 259.62 275.39 325.08 370.39 417.69 428.18 429.11 433.21 462.22 532.08 536.06 541.71 567.00 596.81 642.70 643.96 648.28 671.85 710.42 728.54 731.80 739.30 781.65 799.24 801.00 805.50 852.67 874.80 880.07 892.64 904.69 951.15 960.10 972.27 995.59 1014.99 1018.69 1030.93 1040.01 1040.98 1041.81 1046.52 1047.02 1051.17 1079.71 1090.32 1091.57 1108.59 1140.39 1148.28 1156.07 1214.91 1215.61 1215.99 1236.14 1244.06 1246.34 1274.98 1317.70 1354.63 1359.53 1389.17 1398.48 1399.83 1405.86 1407.18 1410.67 1529.09 1536.20 1542.33 1588.19 1591.69 1594.75 1641.48 1701.56 1709.28 1714.76 1721.80 1728.98 1731.61 1879.89 3241.47 3264.99 3267.40 3267.83 3272.46 3272.65 3276.63 3280.24 3280.60 3286.60 3290.39 3291.88 3295.10 3299.05 3343.89 3686.37
formula: C19H16N2O
InChI: InChI=1/C19H16N2O/c22-19(20-16-10-4-1-5-11-16)21(17-12-6-2-7-13-17)18-14-8-3-9-15-18/h1-15,20H
38 atoms
N  1.37044 -0.422485 0.158649
C  2.741295 -0.664798 0.039839
C  3.236713 -1.778237 0.722205
C  4.577899 -2.108941 0.662783
C  5.456294 -1.336764 -0.081912
C  4.964648 -0.234223 -0.761649
C  3.622694 0.112671 -0.711605
C  0.655665 0.6384 -0.329283
N  -0.714757 0.551323 -0.086862
C  -1.534467 1.687075 -0.31364
C  -1.204265 2.929619 0.217377
C  -2.036833 4.015411 0.00346
C  -3.2109 3.873166 -0.721712
C  -3.545038 2.631379 -1.238654
C  -2.709011 1.543566 -1.043087
C  -1.356264 -0.654286 0.29015
C  -2.096711 -0.699866 1.467619
C  -2.745459 -1.867463 1.834724
C  -2.651443 -3.000692 1.038659
C  -1.914854 -2.95667 -0.13569
C  -1.277868 -1.785721 -0.517871
O  1.144438 1.584361 -0.899078
H  0.873024 -1.101253 0.711569
H  2.56365 -2.392683 1.310277
H  4.934633 -2.975474 1.203747
H  6.50644 -1.590352 -0.130087
H  5.635607 0.379558 -1.3485
H  3.273063 0.979646 -1.246266
H  -0.296962 3.054132 0.791074
H  -1.766686 4.979114 0.414435
H  -3.860577 4.723397 -0.880245
H  -4.456785 2.506257 -1.807646
H  -2.972616 0.579147 -1.457825
H  -2.163786 0.185723 2.086133
H  -3.320465 -1.893859 2.750762
H  -3.153977 -3.912856 1.330837
H  -1.845956 -3.832577 -0.766859
H  -0.720923 -1.744844 -1.445426
totalener: -916.43003366 hartree
nucrepener: 1647.20571094 hartree
electener: -2563.63574461 hartree
oneelecener: -4514.19135668 hartree
twoeener: 1950.55561208 hartree
kineticenergy: 909.45093577 hartree
exchangeener: -70.174146477550 hartree
correlationener: -6.665741498132 hartree
xcener: -76.839887975682 hartree
chargesum: 0.0000000
charge: -0.791454 0.401250 -0.332386 -0.207881 -0.238760 -0.210396 -0.292034 0.696549 -0.688672 0.343875 -0.245688 -0.223219 -0.227476 -0.218023 -0.259935 0.196733 -0.229128 -0.221743 -0.222789 -0.222769 -0.255049 -0.424758 0.391389 0.214157 0.217734 0.216345 0.221319 0.285940 0.239104 0.222301 0.219389 0.220237 0.236612 0.245720 0.230174 0.228747 0.231764 0.252820
charge: -0.203898 0.037460 -0.168117 -0.126300 -0.157351 -0.121643 -0.158098 0.150459 -0.102795 0.031837 -0.126067 -0.129122 -0.140802 -0.130341 -0.137224 -0.005180 -0.126729 -0.126812 -0.134139 -0.129430 -0.145827 -0.254538 0.271562 0.131730 0.136094 0.134829 0.137140 0.163074 0.148086 0.137943 0.136359 0.137127 0.145497 0.151024 0.141508 0.140350 0.141889 0.150443
qa: -0.7915 0.4013 -0.3324 -0.2079 -0.2388 -0.2104 -0.2920 0.6965 -0.6887 0.3439 -0.2457 -0.2232 -0.2275 -0.2180 -0.2599 0.1967 -0.2291 -0.2217 -0.2228 -0.2228 -0.2550 -0.4248 0.3914 0.2142 0.2177 0.2163 0.2213 0.2859 0.2391 0.2223 0.2194 0.2202 0.2366 0.2457 0.2302 0.2287 0.2318 0.2528
va: 2.9934 3.6587 3.8186 3.8626 3.8163 3.8135 3.7712 4.0900 2.9863 3.7069 3.8199 3.8277 3.8156 3.8307 3.8004 3.7614 3.7864 3.8131 3.8063 3.8093 3.7853 2.2006 0.8264 0.9130 0.9116 0.9130 0.9110 0.8993 0.9075 0.9107 0.9117 0.9116 0.9066 0.9050 0.9084 0.9087 0.9080 0.9004
dispersion: -0.029044042 hartree
energy: -916.396774869866 hartree
dipole: -1.45335 0.49938 -0.95397 -3.42866 2.30571 -1.12296 1.76320 -1.02490 0.73830
magnitude: 1.64808 au
magnitude: 4.18910 debye
temp: 298.15 k
press: 1.00 atm
zeropoint: 0.31587449 hartree
thermalvibcorrection: 0.01451771 hartree
thermalrotcorrection: 0.00141627 hartree
thermaltrasncorrection: 0.00141627 hartree
thermaltotal: -916.06355013 hartree
thermalcorr: 0.01735025 hartree
nonthermalcorr: 0.31587449 hartree
totalcorr: 0.33322474 hartree
thermalcorrenthalpy: 0.00094421 hartree
totalenthalpy: -916.06260592 hartree
vibrat: 0.02560423 hartree
rotat: 0.01643885 hartree
transl: 0.02037108 hartree
total: 0.06241417 hartree
totalentropycorr: -0.06241417 hartree
gibbsenthalpy: -916.12502009 hartree
gibbsminuselec: 0.27175478 hartree
