program: Orca
programVersion: 5.0.4
elementType: N C C C C C C C N C C C C C C C C C C C C O H H H H H H H H H H H H H H H H
charge: 0
multiplicity: 1
keywords: Opt RIJCOSX PBEh-3c
formula: C19H16N2O
InChI: InChI=1/C19H16N2O/c22-19(20-16-10-4-1-5-11-16)21(17-12-6-2-7-13-17)18-14-8-3-9-15-18/h1-15,20H
38 atoms
N  1.37044 -0.422485 0.158649
C  2.741295 -0.664798 0.039839
C  3.236713 -1.778237 0.722205
C  4.577899 -2.108941 0.662783
C  5.456294 -1.336764 -0.081912
C  4.964648 -0.234223 -0.761649
C  3.622694 0.112671 -0.711605
C  0.655665 0.6384 -0.329283
N  -0.714757 0.551323 -0.086862
C  -1.534467 1.687075 -0.31364
C  -1.204265 2.929619 0.217377
C  -2.036833 4.015411 0.00346
C  -3.2109 3.873166 -0.721712
C  -3.545038 2.631379 -1.238654
C  -2.709011 1.543566 -1.043087
C  -1.356264 -0.654286 0.29015
C  -2.096711 -0.699866 1.467619
C  -2.745459 -1.867463 1.834724
C  -2.651443 -3.000692 1.038659
C  -1.914854 -2.95667 -0.13569
C  -1.277868 -1.785721 -0.517871
O  1.144438 1.584361 -0.899078
H  0.873024 -1.101253 0.711569
H  2.56365 -2.392683 1.310277
H  4.934633 -2.975474 1.203747
H  6.50644 -1.590352 -0.130087
H  5.635607 0.379558 -1.3485
H  3.273063 0.979646 -1.246266
H  -0.296962 3.054132 0.791074
H  -1.766686 4.979114 0.414435
H  -3.860577 4.723397 -0.880245
H  -4.456785 2.506257 -1.807646
H  -2.972616 0.579147 -1.457825
H  -2.163786 0.185723 2.086133
H  -3.320465 -1.893859 2.750762
H  -3.153977 -3.912856 1.330837
H  -1.845956 -3.832577 -0.766859
H  -0.720923 -1.744844 -1.445426
totalener: -916.43004595 hartree
nucrepener: 1647.31958610 hartree
electener: -2563.74963205 hartree
oneelecener: -4514.40764530 hartree
twoeener: 1950.65801325 hartree
kineticenergy: 909.44910503 hartree
exchangeener: -70.173894005283 hartree
correlationener: -6.665778689424 hartree
xcener: -76.839672694707 hartree
dispersion: -0.029063614 hartree
dispersion: -0.029064239 hartree
dispersion: -0.029065319 hartree
dispersion: -0.029060408 hartree
dispersion: -0.029055798 hartree
dispersion: -0.029049535 hartree
dispersion: -0.029047242 hartree
dispersion: -0.029044954 hartree
chargesum: -0.0000000
charge: -0.791525 0.401259 -0.332386 -0.207889 -0.238786 -0.210429 -0.291996 0.696484 -0.688731 0.343978 -0.245652 -0.223290 -0.227539 -0.218066 -0.259918 0.196753 -0.229086 -0.221798 -0.222849 -0.222789 -0.255034 -0.424690 0.391403 0.214154 0.217747 0.216357 0.221334 0.285957 0.239117 0.222321 0.219413 0.220254 0.236619 0.245735 0.230192 0.228776 0.231773 0.252829
charge: -0.203951 0.037465 -0.168106 -0.126309 -0.157367 -0.121667 -0.158066 0.150419 -0.102815 0.031881 -0.126025 -0.129169 -0.140845 -0.130377 -0.137188 -0.005173 -0.126697 -0.126849 -0.134173 -0.129456 -0.145799 -0.254498 0.271570 0.131730 0.136099 0.134836 0.137149 0.163084 0.148090 0.137952 0.136369 0.137134 0.145499 0.151031 0.141517 0.140364 0.141894 0.150446
qa: -0.7915 0.4013 -0.3324 -0.2079 -0.2388 -0.2104 -0.2920 0.6965 -0.6887 0.3440 -0.2457 -0.2233 -0.2275 -0.2181 -0.2599 0.1968 -0.2291 -0.2218 -0.2228 -0.2228 -0.2550 -0.4247 0.3914 0.2142 0.2177 0.2164 0.2213 0.2860 0.2391 0.2223 0.2194 0.2203 0.2366 0.2457 0.2302 0.2288 0.2318 0.2528
va: 2.9934 3.6587 3.8186 3.8626 3.8163 3.8135 3.7712 4.0901 2.9863 3.7069 3.8199 3.8277 3.8155 3.8307 3.8004 3.7614 3.7863 3.8131 3.8063 3.8093 3.7853 2.2007 0.8264 0.9130 0.9116 0.9130 0.9110 0.8993 0.9075 0.9107 0.9117 0.9116 0.9066 0.9049 0.9084 0.9087 0.9080 0.9004
dispersion: -0.029044042 hartree
energy: -916.396774856580 hartree
dipole: -1.45335 0.49965 -0.95371 -3.42866 2.30581 -1.12285 1.76320 -1.02504 0.73817
magnitude: 1.64780 au
magnitude: 4.18837 debye
