program: Orca
programVersion: 5.0.4
elementType: N C C C C C C C N C C C C C C C C C C C C H H H H H H H H H H H H H H H H
charge: 2
multiplicity: 1
keywords: Freq RIJCOSX PBEh-3c
frequency: 0.00 0.00 0.00 0.00 0.00 0.00 21.33 28.25 35.73 47.48 68.31 75.20 107.38 139.57 225.57 235.77 259.42 303.51 309.10 349.00 409.73 412.73 423.36 427.25 463.70 469.08 500.81 567.26 613.05 626.66 628.87 637.14 653.27 659.01 696.23 702.87 707.22 741.47 784.12 802.59 803.76 827.98 834.33 862.00 865.58 869.94 924.08 976.16 980.92 985.89 1036.99 1037.95 1038.12 1040.14 1042.80 1044.04 1072.44 1073.26 1074.45 1074.90 1075.72 1077.21 1140.06 1151.92 1156.63 1158.73 1182.82 1204.49 1233.44 1234.83 1235.56 1243.69 1249.10 1251.11 1290.92 1380.38 1388.18 1397.49 1418.00 1419.61 1423.39 1485.55 1542.37 1548.91 1554.68 1556.64 1561.51 1574.12 1679.78 1680.88 1687.23 1694.05 1700.12 1709.28 2192.47 3255.65 3260.21 3262.00 3263.48 3285.60 3287.87 3294.58 3295.27 3295.72 3303.46 3304.33 3304.46 3309.36 3309.98 3310.67 3441.32
frequency: 21.33 28.25 35.73 47.48 68.31 75.20 107.38 139.57 225.57 235.77 259.42 303.51 309.10 349.00 409.73 412.73 423.36 427.25 463.70 469.08 500.81 567.26 613.05 626.66 628.87 637.14 653.27 659.01 696.23 702.87 707.22 741.47 784.12 802.59 803.76 827.98 834.33 862.00 865.58 869.94 924.08 976.16 980.92 985.89 1036.99 1037.95 1038.12 1040.14 1042.80 1044.04 1072.44 1073.26 1074.45 1074.90 1075.72 1077.21 1140.06 1151.92 1156.63 1158.73 1182.82 1204.49 1233.44 1234.83 1235.56 1243.69 1249.10 1251.11 1290.92 1380.38 1388.18 1397.49 1418.00 1419.61 1423.39 1485.55 1542.37 1548.91 1554.68 1556.64 1561.51 1574.12 1679.78 1680.88 1687.23 1694.05 1700.12 1709.28 2192.47 3255.65 3260.21 3262.00 3263.48 3285.60 3287.87 3294.58 3295.27 3295.72 3303.46 3304.33 3304.46 3309.36 3309.98 3310.67 3441.32
formula: C19H16N2
InChI: InChI=1/C19H16N2/c1-4-10-17(11-5-1)20-16-21(18-12-6-2-7-13-18)19-14-8-3-9-15-19/h1-15,20H
37 atoms
N  1.431857 -0.406533 -1.38718
C  2.670796 -0.34402 -0.668582
C  3.831242 -0.333218 -1.432092
C  5.044873 -0.258725 -0.770618
C  5.078363 -0.207441 0.615969
C  3.898916 -0.234439 1.358307
C  2.67642 -0.305337 0.721067
C  0.275855 -0.23919 -0.95261
N  -0.829916 -0.0148 -0.421699
C  -1.291395 1.330829 -0.199361
C  -0.366281 2.306815 0.161259
C  -0.822703 3.598288 0.338785
C  -2.170096 3.892451 0.15025
C  -3.072947 2.898892 -0.212852
C  -2.642653 1.597189 -0.394223
C  -1.635821 -1.161214 -0.046085
C  -1.792296 -2.196974 -0.959535
C  -2.531284 -3.299903 -0.568182
C  -3.084594 -3.347437 0.705479
C  -2.914649 -2.291832 1.597613
C  -2.184969 -1.176231 1.23074
H  1.520632 -0.629213 -2.386504
H  3.805722 -0.370904 -2.515295
H  5.962846 -0.244736 -1.341053
H  6.029722 -0.156486 1.127602
H  3.93857 -0.213357 2.438322
H  1.766475 -0.36176 1.307366
H  0.674834 2.068912 0.349625
H  -0.133676 4.374308 0.641012
H  -2.520445 4.905465 0.294798
H  -4.116283 3.139779 -0.360709
H  -3.336521 0.823423 -0.695594
H  -1.40613 -2.127877 -1.969921
H  -2.691789 -4.111568 -1.263832
H  -3.665827 -4.209462 1.003518
H  -3.353464 -2.339781 2.584474
H  -2.043384 -0.353712 1.919743
totalener: -840.60518106 hartree
nucrepener: 1487.10336026 hartree
electener: -2327.70854133 hartree
oneelecener: -4049.84677304 hartree
twoeener: 1722.13823171 hartree
kineticenergy: 834.20968467 hartree
exchangeener: -65.183314312394 hartree
correlationener: -6.190953862850 hartree
xcener: -71.374268175245 hartree
chargesum: 2.0000000
charge: -0.585090 0.332730 -0.257213 -0.211918 -0.182737 -0.211145 -0.256329 0.587480 -0.466442 0.261304 -0.261179 -0.215264 -0.179041 -0.214588 -0.219298 0.231703 -0.249823 -0.217013 -0.179718 -0.214741 -0.221653 0.474428 0.286783 0.309227 0.309746 0.301885 0.264918 0.269598 0.302090 0.309783 0.307127 0.307023 0.268281 0.304605 0.309114 0.305921 0.299448
charge: 0.018731 -0.009426 -0.104947 -0.083268 -0.051879 -0.081620 -0.129262 0.267445 0.137055 -0.008190 -0.120691 -0.087922 -0.047923 -0.085337 -0.096228 -0.008492 -0.117932 -0.088960 -0.052821 -0.083808 -0.107007 0.342564 0.167684 0.179554 0.179694 0.175584 0.156809 0.159235 0.176150 0.179564 0.178454 0.177567 0.160954 0.177291 0.179336 0.177771 0.174271
qa: -0.5851 0.3327 -0.2572 -0.2119 -0.1827 -0.2111 -0.2563 0.5875 -0.4664 0.2613 -0.2612 -0.2153 -0.1790 -0.2146 -0.2193 0.2317 -0.2498 -0.2170 -0.1797 -0.2147 -0.2217 0.4744 0.2868 0.3092 0.3097 0.3019 0.2649 0.2696 0.3021 0.3098 0.3071 0.3070 0.2683 0.3046 0.3091 0.3059 0.2994
va: 3.3526 3.3863 3.7464 3.8118 3.7375 3.8238 3.7497 3.7376 3.4599 3.4603 3.7535 3.8134 3.7349 3.7881 3.7361 3.4714 3.7666 3.8045 3.7369 3.7868 3.7424 0.7544 0.8824 0.8746 0.8737 0.8782 0.8928 0.8895 0.8785 0.8736 0.8760 0.8729 0.8915 0.8774 0.8741 0.8767 0.8790
dispersion: -0.027547293 hartree
energy: -840.579896167935 hartree
dipole: 0.60340 0.02974 0.63315 0.34218 -0.55710 -0.21493 1.94059 -2.88994 -0.94935
magnitude: 1.16118 au
magnitude: 2.95147 debye
temp: 298.15 k
press: 1.00 atm
zeropoint: 0.30951770 hartree
thermalvibcorrection: 0.01386947 hartree
thermalrotcorrection: 0.00141627 hartree
thermaltrasncorrection: 0.00141627 hartree
thermaltotal: -840.25367645 hartree
thermalcorr: 0.01670201 hartree
nonthermalcorr: 0.30951770 hartree
totalcorr: 0.32621972 hartree
thermalcorrenthalpy: 0.00094421 hartree
totalenthalpy: -840.25273224 hartree
vibrat: 0.02440990 hartree
rotat: 0.01635594 hartree
transl: 0.02029023 hartree
total: 0.06105608 hartree
totalentropycorr: -0.06105608 hartree
gibbsenthalpy: -840.31378832 hartree
gibbsminuselec: 0.26610785 hartree
