program: Orca
programVersion: 5.0.4
elementType: N C C C C C C C N C C C C C C C C C C C C H H H H H H H H H H H H H H H H
charge: 2
multiplicity: 1
keywords: SP DSD-BLYP D3BJ def2-QZVPP def2-QZVPP/C def2/J TightSCF
formula: C19H16N2
InChI: InChI=1/C19H16N2/c1-4-10-17(11-5-1)20-16-21(18-12-6-2-7-13-18)19-14-8-3-9-15-19/h1-15,20H
37 atoms
N  1.44487 -0.395656 -1.328127
C  2.683808 -0.333143 -0.609529
C  3.844255 -0.32234 -1.373039
C  5.057886 -0.247847 -0.711565
C  5.091375 -0.196563 0.675022
C  3.911928 -0.223561 1.41736
C  2.689432 -0.294459 0.78012
C  0.288867 -0.228313 -0.893557
N  -0.816904 -0.003922 -0.362646
C  -1.278383 1.341707 -0.140308
C  -0.353269 2.317693 0.220312
C  -0.809691 3.609165 0.397838
C  -2.157084 3.903329 0.209303
C  -3.059935 2.909769 -0.153799
C  -2.629641 1.608067 -0.33517
C  -1.622808 -1.150336 0.012968
C  -1.779283 -2.186097 -0.900482
C  -2.518272 -3.289026 -0.509129
C  -3.071581 -3.33656 0.764532
C  -2.901637 -2.280954 1.656666
C  -2.171957 -1.165354 1.289793
H  1.533644 -0.618335 -2.327451
H  3.818735 -0.360026 -2.456242
H  5.975858 -0.233859 -1.2820
H  6.042734 -0.145609 1.186655
H  3.951583 -0.202479 2.497375
H  1.779487 -0.350883 1.366419
H  0.687847 2.079789 0.408678
H  -0.120663 4.385186 0.700065
H  -2.507433 4.916343 0.353851
H  -4.10327 3.150656 -0.301656
H  -3.323508 0.8343 -0.636541
H  -1.393117 -2.116999 -1.910868
H  -2.678776 -4.10069 -1.204779
H  -3.652815 -4.198584 1.062571
H  -3.340452 -2.328904 2.643527
H  -2.030371 -0.342835 1.978796
totalener: -840.02231867 hartree
nucrepener: 1487.10336083 hartree
electener: -2327.12567950 hartree
oneelecener: -4050.19073614 hartree
twoeener: 1723.06505664 hartree
kineticenergy: 837.76512181 hartree
exchangeener: -36.353980341695 hartree
correlationener: -2.597471592949 hartree
xcener: -38.951451934644 hartree
chargesum: 2.0000000
charge: -0.066574 0.191771 -0.083893 -0.054676 -0.071109 -0.055968 -0.045475 0.157446 0.140044 0.204878 -0.099884 -0.067398 -0.077842 -0.066945 -0.075666 0.241505 -0.104148 -0.073672 -0.083026 -0.062218 -0.096562 0.277204 0.101239 0.145358 0.148160 0.143432 0.093863 0.087326 0.143429 0.149853 0.148035 0.135581 0.095393 0.146443 0.149994 0.150650 0.133450
charge: 0.664254 -0.178059 0.113124 0.131191 0.150165 0.126713 0.092364 0.034743 0.505359 -0.167249 0.098237 0.125760 0.152803 0.130806 0.122020 -0.169365 0.099139 0.126224 0.149516 0.130194 0.113740 -0.035572 -0.038027 -0.030973 -0.028765 -0.033579 -0.046677 -0.042731 -0.033854 -0.028188 -0.031862 -0.031506 -0.042583 -0.033157 -0.028525 -0.032173 -0.033505
qa: -0.0666 0.1918 -0.0839 -0.0547 -0.0711 -0.0560 -0.0455 0.1574 0.1400 0.2049 -0.0999 -0.0674 -0.0778 -0.0669 -0.0757 0.2415 -0.1041 -0.0737 -0.0830 -0.0622 -0.0966 0.2772 0.1012 0.1454 0.1482 0.1434 0.0939 0.0873 0.1434 0.1499 0.1480 0.1356 0.0954 0.1464 0.1500 0.1506 0.1334
va: 3.4625 3.4146 3.8069 3.8174 3.8673 3.7963 3.7515 3.7614 3.3153 3.4049 3.7886 3.8082 3.8775 3.7955 3.7468 3.3843 3.8132 3.8199 3.8801 3.8092 3.7665 0.9625 0.9945 0.9742 0.9735 0.9737 0.9967 1.0103 0.9734 0.9711 0.9734 0.9949 0.9917 0.9744 0.9723 0.9722 0.9937
total: -841.780032736 hartree
dispersion: -0.031875411 hartree
energy: -841.811908146863 hartree
dipole: 0.60340 0.01718 0.62059 0.34218 -0.59249 -0.25032 1.94059 -2.95365 -1.01307
magnitude: 1.21412 au
magnitude: 3.08605 debye
