program: Orca
programVersion: 5.0.4
elementType: F C N C C C C C C C C C C C C F N C C C C C C C C C C C C H H H H H H H H H H H H H H H H H H H H
charge: 0
multiplicity: 1
keywords: Opt RIJCOSX PBEh-3c
formula: C25H20F2N2
InChI: InChI=1/C25H20F2N2/c26-25(27,28(21-13-5-1-6-14-21)22-15-7-2-8-16-22)29(23-17-9-3-10-18-23)24-19-11-4-12-20-24/h1-20H
49 atoms
F  -0.480785 2.079368 -1.121656
C  -0.053011 0.782465 -1.044434
N  1.033047 0.725922 -0.153988
C  1.482338 -0.532797 0.324886
C  1.652971 -1.637352 -0.503328
C  2.066097 -2.848427 0.032265
C  2.337769 -2.9622 1.386853
C  2.190874 -1.853646 2.208243
C  1.758216 -0.648539 1.682845
C  1.972134 1.796757 -0.123499
C  1.703457 2.944548 0.611419
C  2.635633 3.968941 0.664726
C  3.844398 3.849221 -0.00445
C  4.117477 2.699146 -0.730392
C  3.183122 1.678034 -0.794835
F  0.303039 0.509341 -2.336655
N  -1.073565 -0.107804 -0.665818
C  -2.057624 -0.497556 -1.619467
C  -1.779745 -1.48565 -2.555711
C  -2.754317 -1.880394 -3.458795
C  -4.014929 -1.303336 -3.424491
C  -4.297381 -0.325864 -2.4818
C  -3.321637 0.08028 -1.58584
C  -1.428107 -0.227007 0.703131
C  -1.633175 -1.505765 1.210463
C  -1.977659 -1.68444 2.538817
C  -2.104783 -0.589452 3.38159
C  -1.900882 0.68582 2.878076
C  -1.576494 0.872383 1.542208
H  1.468268 -1.556825 -1.565243
H  2.188838 -3.703749 -0.619383
H  2.664958 -3.907314 1.799385
H  2.396357 -1.931201 3.267601
H  1.614064 0.209871 2.325682
H  0.770201 3.026317 1.151599
H  2.418645 4.86051 1.238067
H  4.572897 4.647676 0.043608
H  5.059096 2.598005 -1.253568
H  3.396352 0.779188 -1.358807
H  -0.806134 -1.955745 -2.568092
H  -2.529535 -2.648764 -4.186693
H  -4.775794 -1.617262 -4.126639
H  -5.278795 0.128358 -2.446869
H  -3.540974 0.840312 -0.847193
H  -1.499731 -2.359065 0.558783
H  -2.129025 -2.685153 2.92112
H  -2.36244 -0.729214 4.42298
H  -2.007263 1.547775 3.523715
H  -1.446164 1.874782 1.159585
totalener: -1271.19828456 hartree
nucrepener: 2800.58228904 hartree
electener: -4071.78057361 hartree
oneelecener: -7302.26235983 hartree
twoeener: 3230.48178622 hartree
kineticenergy: 1261.80293730 hartree
exchangeener: -94.993812850537 hartree
correlationener: -8.911137860988 hartree
xcener: -103.904950711525 hartree
dispersion: -0.042874102 hartree
chargesum: 0.0000000
charge: -0.331493 1.069009 -0.732585 0.285638 -0.271041 -0.223453 -0.227030 -0.216997 -0.212479 0.295406 -0.243702 -0.223877 -0.221500 -0.221005 -0.230485 -0.331742 -0.731903 0.296083 -0.243776 -0.224507 -0.220892 -0.221338 -0.233110 0.284873 -0.214165 -0.216730 -0.227836 -0.223160 -0.271625 0.232900 0.219142 0.218463 0.219362 0.234059 0.222897 0.219974 0.221281 0.221868 0.231040 0.223067 0.220032 0.220689 0.221659 0.232871 0.234892 0.219242 0.218396 0.219114 0.234475
charge: -0.170028 0.316657 -0.110811 0.022709 -0.148082 -0.134634 -0.140565 -0.127612 -0.117828 0.019058 -0.126820 -0.132957 -0.133546 -0.130894 -0.122957 -0.169999 -0.109572 0.019461 -0.127413 -0.132998 -0.134349 -0.130923 -0.123833 0.022953 -0.118514 -0.127501 -0.141217 -0.134782 -0.149046 0.142383 0.135827 0.135658 0.137291 0.147450 0.140730 0.137149 0.136913 0.137883 0.146338 0.140775 0.137075 0.136782 0.137825 0.146756 0.147744 0.137289 0.135614 0.135763 0.142796
qa: -0.3315 1.0690 -0.7326 0.2856 -0.2710 -0.2235 -0.2270 -0.2170 -0.2125 0.2954 -0.2437 -0.2239 -0.2215 -0.2210 -0.2305 -0.3317 -0.7319 0.2961 -0.2438 -0.2245 -0.2209 -0.2213 -0.2331 0.2849 -0.2142 -0.2167 -0.2278 -0.2232 -0.2716 0.2329 0.2191 0.2185 0.2194 0.2341 0.2229 0.2200 0.2213 0.2219 0.2310 0.2231 0.2200 0.2207 0.2217 0.2329 0.2349 0.2192 0.2184 0.2191 0.2345
va: 1.0778 3.9440 2.9417 3.7395 3.7969 3.8153 3.8170 3.8219 3.8082 3.7379 3.8409 3.8099 3.8127 3.8124 3.8043 1.0778 2.9451 3.7382 3.8403 3.8114 3.8129 3.8132 3.8026 3.7424 3.8084 3.8225 3.8169 3.8154 3.7961 0.9211 0.9120 0.9120 0.9119 0.9112 0.9134 0.9116 0.9111 0.9111 0.9117 0.9134 0.9116 0.9113 0.9113 0.9110 0.9106 0.9119 0.9121 0.9120 0.9206
dispersion: -0.042898391 hartree
energy: -1271.154914992442 hartree
dipole: 0.46905 -0.42359 0.04546 -6.90706 6.44473 -0.46232 9.21361 -8.59597 0.61764
magnitude: 0.77284 au
magnitude: 1.96441 debye
