program: Orca
programVersion: 5.0.4
elementType: F C N C C C C C C C C C C C C F N C C C C C C C C C C C C H H H H H H H H H H H H H H H H H H H H
charge: 0
multiplicity: 1
keywords: SP DSD-BLYP D3BJ def2-QZVPP def2-QZVPP/C def2/J TightSCF
formula: C25H20F2N2
InChI: InChI=1/C25H20F2N2/c26-25(27,28(21-13-5-1-6-14-21)22-15-7-2-8-16-22)29(23-17-9-3-10-18-23)24-19-11-4-12-20-24/h1-20H
49 atoms
F  -0.472422 1.955848 -0.956952
C  -0.044648 0.658945 -0.879731
N  1.041411 0.602402 0.010716
C  1.490701 -0.656317 0.48959
C  1.661334 -1.760872 -0.338624
C  2.07446 -2.971946 0.196968
C  2.346132 -3.08572 1.551557
C  2.199237 -1.977166 2.372946
C  1.766579 -0.772059 1.847548
C  1.980497 1.673238 0.041205
C  1.71182 2.821028 0.776123
C  2.643996 3.845422 0.82943
C  3.852761 3.725701 0.160254
C  4.125841 2.575626 -0.565688
C  3.191486 1.554514 -0.630131
F  0.311402 0.385822 -2.171951
N  -1.065201 -0.231323 -0.501115
C  -2.049261 -0.621075 -1.454764
C  -1.771381 -1.609169 -2.391008
C  -2.745954 -2.003914 -3.294091
C  -4.006566 -1.426855 -3.259787
C  -4.289018 -0.449384 -2.317096
C  -3.313274 -0.04324 -1.421136
C  -1.419744 -0.350527 0.867835
C  -1.624811 -1.629285 1.375167
C  -1.969296 -1.807959 2.70352
C  -2.09642 -0.712972 3.546293
C  -1.892519 0.562301 3.042779
C  -1.568131 0.748863 1.706911
H  1.476631 -1.680345 -1.40054
H  2.197201 -3.827268 -0.45468
H  2.673321 -4.030833 1.964088
H  2.40472 -2.054721 3.432304
H  1.622427 0.086351 2.490385
H  0.778564 2.902797 1.316303
H  2.427008 4.736991 1.40277
H  4.58126 4.524156 0.208312
H  5.067459 2.474485 -1.088864
H  3.404715 0.655669 -1.194103
H  -0.797771 -2.079264 -2.403388
H  -2.521172 -2.772284 -4.02199
H  -4.767431 -1.740781 -3.961935
H  -5.270432 0.004839 -2.282165
H  -3.53261 0.716792 -0.682489
H  -1.491368 -2.482584 0.723486
H  -2.120662 -2.808673 3.085824
H  -2.354077 -0.852734 4.587684
H  -1.9989 1.424255 3.688418
H  -1.437801 1.751262 1.324289
totalener: -1270.43621506 hartree
nucrepener: 2801.06800331 hartree
electener: -4071.50421837 hartree
oneelecener: -7302.96616004 hartree
twoeener: 3231.46194167 hartree
kineticenergy: 1267.35825879 hartree
exchangeener: -52.953596022978 hartree
correlationener: -3.747752229241 hartree
xcener: -56.701348252219 hartree
chargesum: -0.0000000
charge: -0.319117 0.676684 -0.206407 0.290710 -0.147000 -0.139307 -0.147154 -0.136222 -0.061256 0.212575 -0.113996 -0.131697 -0.123535 -0.120946 -0.117458 -0.321411 -0.208818 0.214117 -0.114615 -0.131159 -0.117739 -0.121714 -0.117689 0.286776 -0.059279 -0.134452 -0.147305 -0.142179 -0.149741 0.091542 0.100068 0.091610 0.095475 0.085717 0.086112 0.095168 0.089691 0.091732 0.098158 0.083893 0.093031 0.086554 0.092463 0.097564 0.088729 0.094630 0.092352 0.099018 0.095825
charge: 0.356223 -1.058265 0.403580 -0.210632 0.081228 0.063220 0.061197 0.070616 0.095608 -0.205425 0.084361 0.067121 0.064971 0.068985 0.092848 0.356240 0.404953 -0.204666 0.083712 0.066897 0.064576 0.068541 0.092649 -0.211170 0.095660 0.070399 0.060859 0.062854 0.080798 -0.057327 -0.059790 -0.061718 -0.058691 -0.045679 -0.053676 -0.059646 -0.060357 -0.059242 -0.047527 -0.053976 -0.059580 -0.060587 -0.059219 -0.047442 -0.045730 -0.058671 -0.061849 -0.059879 -0.057351
qa: -0.3191 0.6767 -0.2064 0.2907 -0.1470 -0.1393 -0.1472 -0.1362 -0.0613 0.2126 -0.1140 -0.1317 -0.1235 -0.1209 -0.1175 -0.3214 -0.2088 0.2141 -0.1146 -0.1312 -0.1177 -0.1217 -0.1177 0.2868 -0.0593 -0.1345 -0.1473 -0.1422 -0.1497 0.0915 0.1001 0.0916 0.0955 0.0857 0.0861 0.0952 0.0897 0.0917 0.0982 0.0839 0.0930 0.0866 0.0925 0.0976 0.0887 0.0946 0.0924 0.0990 0.0958
va: 0.9697 4.2594 2.5906 3.6193 3.7406 3.8026 3.8428 3.8141 3.7030 3.5560 3.7344 3.8205 3.8441 3.8101 3.7535 0.9653 2.6049 3.5559 3.7324 3.8166 3.8444 3.8119 3.7569 3.6345 3.7088 3.8028 3.8367 3.8036 3.7490 1.0085 0.9815 0.9870 0.9836 1.0086 1.0063 0.9831 0.9861 0.9848 0.9985 1.0068 0.9844 0.9870 0.9853 0.9998 1.0044 0.9837 0.9865 0.9816 1.0066
total: -1272.974482579 hartree
dispersion: -0.047867676 hartree
energy: -1273.022350254835 hartree
dipole: 0.46905 -0.42303 0.04601 -6.90706 6.42567 -0.48139 9.21361 -8.57117 0.64244
magnitude: 0.80410 au
magnitude: 2.04386 debye
