program: Orca
programVersion: 5.0.4
elementType: N C N C C C C H H H H H H
charge: 2
multiplicity: 1
keywords: SP DSD-BLYP D3BJ def2-QZVPP def2-QZVPP/C def2/J TightSCF
formula: C5H6N2
InChI: InChI=1/C5H6N2/c6-5-7-3-1-2-4-7/h1-4H,6H2
13 atoms
N  2.668575 -0.190558 -0.404308
C  1.449298 -0.102541 -0.220927
N  0.238216 -0.01628 -0.038159
C  -0.75578 -1.058513 -0.356716
C  -1.927832 -0.547014 0.004943
C  -1.748078 0.807454 0.555982
C  -0.463326 1.146422 0.540676
H  3.1101 0.115228 -1.288957
H  3.30159 -0.577262 0.317385
H  -0.430672 -1.991752 -0.790453
H  -2.87466 -1.061458 -0.095179
H  -2.542303 1.444133 0.92354
H  0.1016 2.016347 0.838817
totalener: -301.97561894 hartree
nucrepener: 270.97469700 hartree
electener: -572.95031594 hartree
oneelecener: -923.48226256 hartree
twoeener: 350.53194662 hartree
kineticenergy: 301.15579312 hartree
exchangeener: -12.653743516757 hartree
correlationener: -0.879525081511 hartree
xcener: -13.533268598268 hartree
chargesum: 2.0000000
charge: -0.089412 0.485653 0.050514 0.021186 0.035952 0.031765 0.022473 0.347152 0.346899 0.174106 0.200226 0.201091 0.172396
charge: 0.861245 0.084058 0.505225 0.134257 0.199538 0.199168 0.135132 -0.010600 -0.010572 -0.040695 -0.008024 -0.007981 -0.040752
qa: -0.0894 0.4857 0.0505 0.0212 0.0360 0.0318 0.0225 0.3472 0.3469 0.1741 0.2002 0.2011 0.1724
va: 3.5431 3.8538 3.5809 3.6469 3.7932 3.7910 3.6464 0.9044 0.9047 0.9794 0.9655 0.9651 0.9799
total: -302.575535883 hartree
dispersion: -0.007259248 hartree
energy: -302.582795130668 hartree
dipole: 0.64052 2.23067 2.87119 -0.05252 -0.15489 -0.20741 -0.09142 -0.34272 -0.43414
magnitude: 2.91122 au
magnitude: 7.39974 debye
