program: Orca
programVersion: 5.0.4
elementType: F N F C N C C C C H H H H
charge: 2
multiplicity: 1
keywords: Opt RIJCOSX PBEh-3c
formula: C5H4F2N2
InChI: InChI=1/C5H4F2N2/c6-9(7)5-8-3-1-2-4-8/h1-4H
13 atoms
F  3.292241 -0.439082 1.25721
N  2.655399 0.013054 0.21897
F  3.453292 0.472923 -0.696902
C  1.42534 0.004465 0.116829
N  0.189426 0.002512 0.013739
C  -0.688311 1.079221 0.448357
C  -1.921359 0.666306 0.158268
C  -1.866983 -0.684552 -0.469203
C  -0.602425 -1.088305 -0.558679
H  -0.274055 1.970038 0.896923
H  -2.825589 1.230069 0.350948
H  -2.726259 -1.252961 -0.802501
H  -0.110817 -1.973687 -0.93396
totalener: -500.00222529 hartree
nucrepener: 422.91891323 hartree
electener: -922.92113852 hartree
oneelecener: -1495.44222007 hartree
twoeener: 572.52108155 hartree
kineticenergy: 496.93436142 hartree
exchangeener: -33.513573954582 hartree
correlationener: -2.875897415993 hartree
xcener: -36.389471370574 hartree
dispersion: -0.006286127 hartree
dispersion: -0.006286081 hartree
dispersion: -0.006286018 hartree
dispersion: -0.006286548 hartree
dispersion: -0.006286044 hartree
dispersion: -0.006286039 hartree
energy: -697.1550 -697.1420 -418.4071 -414.7805 -301.2034 -296.3108 -296.3007 -295.6978 -295.6417 -52.7875 -49.8102 -43.7430 -41.2471 -37.0099 -34.0572 -33.0939 -31.3193 -31.3102 -30.2984 -29.2072 -27.7755 -26.7040 -26.4399 -26.3416 -25.7220 -25.1348 -24.8013 -23.7632 -22.9109 -22.6221 -20.8310 -18.5418 -14.8052 -12.9566 -9.7954 -9.7243 -7.7476 -7.7260 -5.5999 -5.4679 -5.4135 -4.0690 -3.2529 -2.9295 -2.6903 -0.5111 -0.4963 -0.1660 1.5528 2.3293 2.8278 4.5898 4.6311 4.7051 5.4139 5.4548 5.9385 6.7691 6.8129 8.0367 8.2114 8.9375 9.5820 11.6824 11.8151 12.9695 13.0786 14.1549 14.8164 15.3064 15.8757 16.6775 17.1225 17.8723 18.1410 19.8975 20.6439 20.6709 20.7661 21.0535 21.5350 22.1474 22.4048 22.8411 23.2476 23.5677 23.6522 25.0741 25.1302 26.2122 27.2601 27.5184 27.7897 28.7764 30.1271 30.3696 31.2837 31.4012 33.3733 33.7008 34.9025 36.3385 38.3767 38.6745 42.1913 42.5261 44.9187 45.1067 45.1526 45.7418 46.2327 47.8332 48.8817 50.5293 51.1778 51.9837 52.2181 53.5405 53.6318 53.7373 56.2679 58.8139 59.0100 60.4905 63.9003 63.9159 67.5591 69.7870 70.8023 72.5153 73.8298 75.5814 77.5903 80.2725 352.1030 359.4717 371.4272 371.9101 378.0141 512.7441 517.5521 883.6370 885.8147 electronvolt
chargesum: 2.0000000
charge: -0.091280 0.645588 -0.090646 0.696528 -0.392788 0.019824 -0.176743 -0.179002 0.019850 0.390405 0.384213 0.383662 0.390390
charge: 0.064330 0.503323 0.064986 0.313023 0.177914 -0.036307 0.033410 0.026059 -0.032131 0.214297 0.228290 0.228392 0.214415
qa: -0.0913 0.6456 -0.0906 0.6965 -0.3928 0.0198 -0.1767 -0.1790 0.0198 0.3904 0.3842 0.3837 0.3904
va: 1.2333 3.9058 1.2341 3.6896 3.5381 3.3585 3.7072 3.7126 3.3561 0.8251 0.8384 0.8388 0.8252
dispersion: -0.006286092 hartree
energy: -499.985313838771 hartree
dipole: -13.53889 11.73002 -1.80887 -0.06439 0.06049 -0.00390 -1.11952 0.97024 -0.14928
magnitude: 1.81502 au
magnitude: 4.61342 debye
