program: Orca
programVersion: 5.0.4
elementType: O C N C C C C N C C C C H H H H H H H H
charge: 0
multiplicity: 1
keywords: Opt RIJCOSX PBEh-3c
formula: C9H8N2O
InChI: InChI=1/C9H8N2O/c12-9(10-5-1-2-6-10)11-7-3-4-8-11/h1-8H
20 atoms
O  -0.309036 -1.552188 -1.776549
C  -0.15373 -0.772169 -0.881344
N  -1.2044 -0.341208 -0.075248
C  -2.521732 -0.406083 -0.482054
C  -3.303328 -0.029997 0.561256
C  -2.443848 0.248639 1.665062
C  -1.166023 0.048184 1.253558
N  1.091668 -0.230192 -0.571572
C  2.275756 -0.849633 -0.91615
C  3.296163 -0.015321 -0.592995
C  2.725037 1.177524 -0.05958
C  1.376257 1.024716 -0.059739
H  -2.77381 -0.706108 -1.484045
H  -4.378297 0.040068 0.547683
H  -2.741642 0.549273 2.656055
H  -0.241646 0.105157 1.801255
H  2.275562 -1.834279 -1.349957
H  4.34483 -0.225975 -0.721852
H  3.255014 2.055436 0.271134
H  0.597306 1.714257 0.21518
totalener: -531.34606345 hartree
nucrepener: 657.87510343 hartree
electener: -1189.22116689 hartree
oneelecener: -2024.44365357 hartree
twoeener: 835.22248669 hartree
kineticenergy: 527.46445252 hartree
exchangeener: -39.653667207970 hartree
correlationener: -3.707989482954 hartree
xcener: -43.361656690924 hartree
dispersion: -0.012554774 hartree
dispersion: -0.012552652 hartree
dispersion: -0.012549330 hartree
dispersion: -0.012548418 hartree
dispersion: -0.012547129 hartree
energy: -530.7328 -400.5268 -400.5173 -288.9124 -285.2782 -285.2739 -285.1664 -285.1655 -284.2935 -284.2860 -284.2395 -284.2338 -33.0612 -30.3337 -30.0907 -25.3086 -24.2242 -22.7566 -22.5377 -20.4683 -18.9285 -18.1911 -17.7752 -17.3440 -17.0829 -15.1803 -14.9753 -14.3512 -14.1999 -13.5617 -13.4210 -13.2525 -12.7872 -12.6123 -12.3108 -12.2581 -11.7992 -10.0469 -8.5898 -8.4588 -7.6051 -7.4230 -0.5340 1.0070 2.5136 2.7078 2.8025 4.1625 4.4661 5.2336 5.5481 5.7215 5.7912 5.9040 6.0595 6.0871 6.2546 6.7970 7.2520 7.3589 8.9175 8.9681 9.3887 10.4591 11.1588 11.5062 12.7179 12.9212 13.8790 14.6622 14.7342 14.9329 15.1164 15.3276 15.7983 16.0037 16.3764 16.4212 16.4380 16.7611 17.5182 17.7270 17.8707 18.3008 18.4303 18.5012 19.0642 19.5642 19.9361 20.6395 22.1650 23.2373 23.2929 23.8687 24.3358 24.7108 24.7332 25.0884 25.5223 25.6118 25.8038 26.5071 26.9270 27.1586 27.5342 28.3526 28.5485 29.0238 29.6946 30.5517 30.6655 31.1157 31.3858 31.7150 33.4006 33.8386 35.4986 36.6113 36.7490 37.4724 38.2646 38.6813 38.9112 39.1053 40.1542 40.3428 41.2401 41.5699 43.1008 43.1679 43.3038 43.9762 45.7819 47.2328 49.3659 50.0927 51.3169 51.7219 51.7716 53.3527 54.1789 54.5996 56.0058 56.0327 56.5539 56.6202 57.5556 59.0026 59.0419 60.0406 60.7879 61.5815 61.7566 61.8777 62.5027 62.9684 63.5168 63.6044 64.1287 64.5133 64.6130 65.1142 65.5434 66.4389 69.3524 70.6326 71.2921 72.2666 72.5645 74.2651 74.8092 74.9876 75.4339 75.4794 76.5111 79.0487 79.4658 80.8189 83.6236 84.5483 84.9582 85.3979 91.5577 92.1322 363.9283 364.0998 372.6815 372.7681 380.4922 381.4717 381.9051 389.7454 390.2421 524.8414 528.5631 700.8598 electronvolt
chargesum: -0.0000000
charge: -0.365306 0.738929 -0.534747 0.009655 -0.316821 -0.298541 -0.044880 -0.534749 0.009950 -0.317083 -0.297852 -0.046042 0.272140 0.223269 0.224474 0.279879 0.271044 0.223323 0.224032 0.279324
charge: -0.191925 0.176463 -0.034531 -0.082259 -0.177567 -0.176241 -0.108624 -0.034694 -0.082273 -0.177857 -0.176555 -0.108818 0.153455 0.141872 0.141791 0.150698 0.153103 0.141818 0.141691 0.150454
qa: -0.3653 0.7389 -0.5347 0.0097 -0.3168 -0.2985 -0.0449 -0.5347 0.0100 -0.3171 -0.2979 -0.0460 0.2721 0.2233 0.2245 0.2799 0.2710 0.2233 0.2240 0.2793
va: 2.2524 4.0270 3.3172 3.6586 3.8631 3.8634 3.6632 3.3163 3.6592 3.8634 3.8638 3.6643 0.8945 0.9210 0.9203 0.8856 0.8949 0.9209 0.9204 0.8859
dispersion: -0.012546363 hartree
energy: -531.323447567492 hartree
dipole: 0.55425 -0.45243 0.10181 2.78974 -2.24918 0.54056 3.18102 -2.55897 0.62205
magnitude: 0.83037 au
magnitude: 2.11063 debye
