program: Orca
programVersion: 5.0.4
elementType: N C C C C C N C C C C H H H H H H H H
charge: 2
multiplicity: 1
keywords: Opt RIJCOSX PBEh-3c
formula: C9H8N2
InChI: InChI=1/C9H8N2/c1-2-6-10(5-1)9-11-7-3-4-8-11/h1-8H
19 atoms
N  -1.23277 -0.015718 -0.068839
C  -2.141312 0.905958 0.616361
C  -3.366024 0.544661 0.245362
C  -3.295938 -0.597408 -0.676307
C  -2.027581 -0.943202 -0.876285
C  -0.000473 -0.002719 0.008592
N  1.231962 0.009741 0.084302
C  2.131743 0.770329 -0.785403
C  3.360899 0.493765 -0.359939
C  3.301988 -0.436026 0.776211
C  2.036545 -0.735213 1.054325
H  -1.740487 1.671579 1.261494
H  -4.275353 1.026636 0.576004
H  -4.145634 -1.088394 -1.12959
H  -1.533604 -1.702763 -1.461238
H  1.723129 1.386475 -1.57058
H  4.266029 0.896546 -0.792386
H  4.157028 -0.824051 1.311776
H  1.549954 -1.360097 1.786339
totalener: -455.41945252 hartree
nucrepener: 531.72449066 hartree
electener: -987.14394318 hartree
oneelecener: -1640.97270078 hartree
twoeener: 653.82875759 hartree
kineticenergy: 452.13031256 hartree
exchangeener: -34.646169130570 hartree
correlationener: -3.226224651443 hartree
xcener: -37.872393782014 hartree
dispersion: -0.010811992 hartree
dispersion: -0.010811796 hartree
dispersion: -0.010811589 hartree
energy: -412.5934 -412.5928 -299.6883 -294.8865 -294.8858 -294.8850 -294.8838 -293.9516 -293.9514 -293.9438 -293.9436 -42.4430 -41.1800 -35.9741 -35.0852 -32.4589 -32.4575 -30.2712 -29.4412 -27.9511 -27.9479 -26.4504 -26.3896 -24.6837 -24.6740 -23.8252 -23.6048 -23.1124 -23.1117 -22.0125 -22.0115 -21.5169 -21.4907 -19.1601 -19.1553 -17.1232 -17.0918 -12.0961 -12.0835 -8.0675 -8.0615 -7.0091 -6.3084 -6.2034 -4.3761 -4.1237 -4.1228 -4.0618 -3.4983 -2.4494 -2.1103 -2.1073 -1.7763 -1.4454 -1.4326 -1.4307 0.6908 0.8566 0.8634 0.9314 1.9996 3.2554 4.1564 4.1663 4.5194 4.5284 5.4213 5.9354 6.4113 6.8039 6.8082 6.8434 6.8455 6.9563 7.5927 7.5943 8.7333 9.1482 9.1522 9.3521 9.3694 9.7741 11.0431 11.5821 11.5942 13.2094 13.2118 13.6025 15.6478 15.6520 15.9106 16.6897 16.6944 17.0150 17.1460 17.4446 17.4457 18.5297 18.5401 18.8804 19.2059 20.1247 21.1698 21.5645 22.3644 22.3667 23.1091 24.7810 24.7829 25.5010 25.9068 27.5893 28.3690 28.4730 28.4885 29.3295 29.3298 31.8621 31.8643 32.8100 33.1033 33.2190 33.7911 34.9883 35.0088 35.5568 38.5223 39.3295 41.2477 41.8215 41.8400 44.0509 44.6611 46.8346 46.8753 47.0616 47.0699 48.8479 48.9125 48.9331 50.8971 50.8977 51.1459 53.6680 53.6698 54.1721 54.1751 54.4456 54.8707 54.9444 57.2239 58.1909 58.2254 60.2040 60.4372 61.0658 62.1645 65.2781 65.3738 65.4592 65.4620 68.3796 69.4825 69.4857 74.6363 74.6403 75.3860 79.1340 79.1810 80.5542 353.1363 354.1863 361.2129 361.2144 372.3660 374.0352 374.7046 380.1182 380.1201 517.0570 519.6569 electronvolt
chargesum: 2.0000000
charge: -0.435562 -0.000197 -0.204315 -0.204047 -0.000567 0.800627 -0.435520 -0.000664 -0.204208 -0.204160 -0.000232 0.364313 0.357843 0.357926 0.364305 0.364284 0.357933 0.357835 0.364405
charge: 0.111196 -0.039682 -0.022102 -0.021990 -0.039842 0.370018 0.111234 -0.039799 -0.022077 -0.021967 -0.039835 0.200200 0.213511 0.213520 0.200187 0.200160 0.213531 0.213488 0.200249
qa: -0.4356 -0.0002 -0.2043 -0.2040 -0.0006 0.8006 -0.4355 -0.0007 -0.2042 -0.2042 -0.0002 0.3643 0.3578 0.3579 0.3643 0.3643 0.3579 0.3578 0.3644
va: 3.5086 3.4090 3.7671 3.7669 3.4092 3.5572 3.5087 3.4092 3.7669 3.7670 3.4090 0.8426 0.8547 0.8546 0.8426 0.8426 0.8546 0.8547 0.8425
dispersion: -0.010812044 hartree
energy: -455.402884460720 hartree
dipole: 0.00162 -0.00144 0.00018 0.00949 -0.00873 0.00076 -0.02913 0.02611 -0.00302
magnitude: 0.00312 au
magnitude: 0.00793 debye
